Intel® C++ Compiler
Support and discussions for creating C++ code that runs on platforms based on Intel® processors.
Announcements
Welcome to the Intel Community. If you get an answer you like, please mark it as an Accepted Solution to help others. Thank you!

TRACKER : : error TRK0002:

DPart1
Beginner
1,710 Views

I just installed Parallel Studio XE and just tried to build my project using Intel C++ instead of MSVC.

When I try to build I get:

1>TRACKER : : error TRK0002: Failed to execute command: ""C:\Program Files (x86)\IntelSWTools\compilers_and_libraries_2020\windows\bin\Intel64\icl.exe" @C:\Users\amonra\AppData\Local\Temp\tmpcd93e637ab564ee4b93b363a73c649f8.rsp". The parameter is incorrect.

If this is the wrong forum I apologise, but I didn't find one for Parallel Studio XE.

Thanks David

0 Kudos
27 Replies
DPart1
Beginner
1,274 Views
10>    Touching ".\x64\Debug\DeepSkyStacker.tlog\unsuccessfulbuild".
10>  Done executing task "Touch".
10>Target "PrepareProjectReferences" skipped. Previously built successfully.
10>Target BuildGenerateSourcesTraverse:
10>  Task "MSBuild" skipped, due to false condition; ('$(BuildPassReferences)' == 'true' and '@(ProjectReferenceWithConfiguration)' != '' and '@(_MSBuildProjectReferenceExistent)' != '' and '%(_MSBuildProjectReferenceExistent.BuildReference)' == 'true') was evaluated as ('' == 'true' and '..\libjpg\libjpg.vcxproj;..\LibRaw\buildfiles\libraw.vcxproj;..\LibTiff\libtiff.vcxproj;..\QHTML_Static\datasource\datasource.vcxproj;..\QHTML_Static\debughlp\DebugHlp.vcxproj;..\QHTML_Static\guitools\guitools.vcxproj;..\QHTML_Static\imglib\imglib.vcxproj;..\QHTML_Static\qhtm\qhtm.vcxproj;..\ZCLass\ZCLass.vcxproj' != '' and '..\libjpg\libjpg.vcxproj;..\LibRaw\buildfiles\libraw.vcxproj;..\LibTiff\libtiff.vcxproj;..\QHTML_Static\datasource\datasource.vcxproj;..\QHTML_Static\debughlp\DebugHlp.vcxproj;..\QHTML_Static\guitools\guitools.vcxproj;..\QHTML_Static\imglib\imglib.vcxproj;..\QHTML_Static\qhtm\qhtm.vcxproj;..\ZCLass\ZCLass.vcxproj' != '' and 'true' == 'true').
10>Target "PrepareForBuild" skipped. Previously built successfully.
10>Target "ResolveReferences" skipped. Previously built successfully.
10>Target BeforeBuildGenerateSources:
10>Target PreBuildEvent:
10>  Task "Message" skipped, due to false condition; ('%(PreBuildEvent.Message)' != '' and '%(PreBuildEvent.Command)' != '') was evaluated as ('' != '' and '' != '').
10>  Task "Exec" skipped, due to false condition; ('%(PreBuildEvent.Command)' != '') was evaluated as ('' != '').
10>Target "CustomBuild" skipped, due to false condition; ('@(CustomBuild)' != '') was evaluated as ('' != '').
10>Target "FxExport" skipped, due to false condition; ('@(FxCompile)' != '') was evaluated as ('' != '').
10>Target "FxCompile" skipped, due to false condition; ('@(FxCompile)' != '') was evaluated as ('' != '').
10>Target "_CreateCopyFileItems" skipped, due to false condition; ('@(CopyFileToFolders)' != '') was evaluated as ('' != '').
10>Target "PrepareForBuild" skipped. Previously built successfully.
10>Target "InitializeBuildStatus" skipped. Previously built successfully.
10>Target "SetBuildDefaultEnvironmentVariables" skipped. Previously built successfully.
10>Target "SetUserMacroEnvironmentVariables" skipped. Previously built successfully.
10>Target _SelectedFiles:
10>Target CopyFileToFolders:
10>  Using "GetOutOfDateItems" task from assembly "C:\Program Files (x86)\Microsoft Visual Studio\2017\Community\Common7\IDE\VC\VCTargets\Microsoft.Build.CppTasks.Common.dll".
10>  Task "GetOutOfDateItems"
10>  Done executing task "GetOutOfDateItems".
10>  Task "Copy" skipped, due to false condition; ('@(_OutOfDateCopyFile)' != '') was evaluated as ('' != '').
10>Target "Xsd" skipped, due to false condition; ('@(Xsd)' != '') was evaluated as ('' != '').
10>Target _Xsd:
10>Target MakeDirsForMidl:
10>  Task "Makedir"
10>  Done executing task "Makedir".
10>Target "Midl" skipped, due to false condition; ('@(Midl)' != '') was evaluated as ('' != '').
10>Target "CustomBuild" skipped, due to false condition; ('@(CustomBuild)' != '') was evaluated as ('' != '').
10>Target "FxExport" skipped, due to false condition; ('@(FxCompile)' != '') was evaluated as ('' != '').
10>Target "FxCompile" skipped, due to false condition; ('@(FxCompile)' != '') was evaluated as ('' != '').
10>Target ComputeMIDLGeneratedCompileInputs:
10>Target AfterMidl:
10>Target _Midl:
10>Target AfterBuildGenerateSources:
10>Target AfterBuildGenerateSourcesEvent:
10>Target _BuildGenerateSourcesAction:
10>Target BuildGenerateSources:
10>Target "PrepareProjectReferences" skipped. Previously built successfully.
10>Target BuildCompileTraverse:
10>  Task "MSBuild" skipped, due to false condition; ('$(BuildPassReferences)' == 'true' and '@(ProjectReferenceWithConfiguration)' != '' and '@(_MSBuildProjectReferenceExistent)' != ''  and '%(_MSBuildProjectReferenceExistent.BuildReference)' == 'true') was evaluated as ('' == 'true' and '..\libjpg\libjpg.vcxproj;..\LibRaw\buildfiles\libraw.vcxproj;..\LibTiff\libtiff.vcxproj;..\QHTML_Static\datasource\datasource.vcxproj;..\QHTML_Static\debughlp\DebugHlp.vcxproj;..\QHTML_Static\guitools\guitools.vcxproj;..\QHTML_Static\imglib\imglib.vcxproj;..\QHTML_Static\qhtm\qhtm.vcxproj;..\ZCLass\ZCLass.vcxproj' != '' and '..\libjpg\libjpg.vcxproj;..\LibRaw\buildfiles\libraw.vcxproj;..\LibTiff\libtiff.vcxproj;..\QHTML_Static\datasource\datasource.vcxproj;..\QHTML_Static\debughlp\DebugHlp.vcxproj;..\QHTML_Static\guitools\guitools.vcxproj;..\QHTML_Static\imglib\imglib.vcxproj;..\QHTML_Static\qhtm\qhtm.vcxproj;..\ZCLass\ZCLass.vcxproj' != ''  and 'true' == 'true').
10>Target "PrepareForBuild" skipped. Previously built successfully.
10>Target "ResolveReferences" skipped. Previously built successfully.
10>Target MessageBuildingWithCompiler:
10>  Using "ICMessage" task from assembly "C:\Program Files (x86)\Microsoft Visual Studio\2017\Community\Common7\IDE\VC\VCTargets\Intel.Build.ICLTasks.v150.dll".
10>  Task "ICMessage"
10>    Building with Intel(R) C++ Compiler 19.1
10>  Done executing task "ICMessage".
10>Target WarningAboutICInstallDir:
10>  Task "ICMessage" skipped, due to false condition; ('$(ICInstallDir)'=='' AND '$(UseEnv)' != 'true') was evaluated as ('C:\Program Files (x86)\IntelSWTools\compilers_and_libraries_2020\windows\'=='' AND '' != 'true').
10>Target BeforeClCompile:
10>Target "ComputeMIDLGeneratedCompileInputs" skipped. Previously built successfully.
10>Target ComputeCLInputPDBName:
10>Target "ResolveReferences" skipped. Previously built successfully.
10>Target ComputeReferenceCLInput:
10>  Task "WriteLinesToFile" skipped, due to false condition; (('@(_ReferenceCopyLocalPaths)'!='') and '$(DesignTimeBuild)' != 'true') was evaluated as ((''!='') and '' != 'true').
10>  Task "Message" skipped, due to false condition; ('$(_REFERENCE_DEBUG)'=='true') was evaluated as (''=='true').
10>Target WarnCompileDuplicatedFilename:
10>  Task "VCMessage" skipped, due to false condition; ('%(ClCompile.ExcludedFromBuild)' != 'true' and '%(Filename)%(Extension)' != '@(ClCompile->'%(Filename)%(Extension)')' and '%(ObjectFileName)' == '@(ClCompile->Metadata(ObjectFileName)->Distinct())') was evaluated as ('' != 'true' and 'BitmapSlider.cpp' != 'BitmapSlider.cpp' and '.\x64\Debug\' == '.\x64\Debug\').
10>  Task "VCMessage" skipped, due to false condition; ('%(ClCompile.ExcludedFromBuild)' != 'true' and '%(Filename)%(Extension)' != '@(ClCompile->'%(Filename)%(Extension)')' and '%(ObjectFileName)' == '@(ClCompile->Metadata(ObjectFileName)->Distinct())') was evaluated as ('' != 'true' and 'BtnST.cpp' != 'BtnST.cpp' and '.\x64\Debug\' == '.\x64\Debug\').
10>  Task "VCMessage" skipped, due to false condition; ('%(ClCompile.ExcludedFromBuild)' != 'true' and '%(Filename)%(Extension)' != '@(ClCompile->'%(Filename)%(Extension)')' and '%(ObjectFileName)' == '@(ClCompile->Metadata(ObjectFileName)->Distinct())') was evaluated as ('' != 'true' and 'ButtonToolbar.cpp' != 'ButtonToolbar.cpp' and '.\x64\Debug\' == '.\x64\Debug\').
10>  Task "VCMessage" skipped, due to false condition; ('%(ClCompile.ExcludedFromBuild)' != 'true' and '%(Filename)%(Extension)' != '@(ClCompile->'%(Filename)%(Extension)')' and '%(ObjectFileName)' == '@(ClCompile->Metadata(ObjectFileName)->Distinct())') was evaluated as ('' != 'true' and 'cdxCRot90DC.cpp' != 'cdxCRot90DC.cpp' and '.\x64\Debug\' == '.\x64\Debug\').
10>  Task "VCMessage" skipped, due to false condition; ('%(ClCompile.ExcludedFromBuild)' != 'true' and '%(Filename)%(Extension)' != '@(ClCompile->'%(Filename)%(Extension)')' and '%(ObjectFileName)' == '@(ClCompile->Metadata(ObjectFileName)->Distinct())') was evaluated as ('' != 'true' and 'cdxCRotBevelLine.cpp' != 'cdxCRotBevelLine.cpp' and '.\x64\Debug\' == '.\x64\Debug\').
10>  Task "VCMessage" skipped, due to false condition; ('%(ClCompile.ExcludedFromBuild)' != 'true' and '%(Filename)%(Extension)' != '@(ClCompile->'%(Filename)%(Extension)')' and '%(ObjectFileName)' == '@(ClCompile->Metadata(ObjectFileName)->Distinct())') was evaluated as ('' != 'true' and 'cgfiltyp.cpp' != 'cgfiltyp.cpp' and '.\x64\Debug\' == '.\x64\Debug\').
10>  Task "VCMessage" skipped, due to false condition; ('%(ClCompile.ExcludedFromBuild)' != 'true' and '%(Filename)%(Extension)' != '@(ClCompile->'%(Filename)%(Extension)')' and '%(ObjectFileName)' == '@(ClCompile->Metadata(ObjectFileName)->Distinct())') was evaluated as ('' != 'true' and 'childprop.cpp' != 'childprop.cpp' and '.\x64\Debug\' == '.\x64\Debug\').
10>  Task "VCMessage" skipped, due to false condition; ('%(ClCompile.ExcludedFromBuild)' != 'true' and '%(Filename)%(Extension)' != '@(ClCompile->'%(Filename)%(Extension)')' and '%(ObjectFileName)' == '@(ClCompile->Metadata(ObjectFileName)->Distinct())') was evaluated as ('' != 'true' and 'ControlPos.cpp' != 'ControlPos.cpp' and '.\x64\Debug\' == '.\x64\Debug\').
10>  Task "VCMessage" skipped, due to false condition; ('%(ClCompile.ExcludedFromBuild)' != 'true' and '%(Filename)%(Extension)' != '@(ClCompile->'%(Filename)%(Extension)')' and '%(ObjectFileName)' == '@(ClCompile->Metadata(ObjectFileName)->Distinct())') was evaluated as ('' != 'true' and 'CtrlCache.cpp' != 'CtrlCache.cpp' and '.\x64\Debug\' == '.\x64\Debug\').
10>  Task "VCMessage" skipped, due to false condition; ('%(ClCompile.ExcludedFromBuild)' != 'true' and '%(Filename)%(Extension)' != '@(ClCompile->'%(Filename)%(Extension)')' and '%(ObjectFileName)' == '@(ClCompile->Metadata(ObjectFileName)->Distinct())') was evaluated as ('' != 'true' and 'CustomTabCtrl.cpp' != 'CustomTabCtrl.cpp' and '.\x64\Debug\' == '.\x64\Debug\').
10>  Task "VCMessage" skipped, due to false condition; ('%(ClCompile.ExcludedFromBuild)' != 'true' and '%(Filename)%(Extension)' != '@(ClCompile->'%(Filename)%(Extension)')' and '%(ObjectFileName)' == '@(ClCompile->Metadata(ObjectFileName)->Distinct())') was evaluated as ('' != 'true' and 'FolderDlg.cpp' != 'FolderDlg.cpp' and '.\x64\Debug\' == '.\x64\Debug\').
10>  Task "VCMessage" skipped, due to false condition; ('%(ClCompile.ExcludedFromBuild)' != 'true' and '%(Filename)%(Extension)' != '@(ClCompile->'%(Filename)%(Extension)')' and '%(ObjectFileName)' == '@(ClCompile->Metadata(ObjectFileName)->Distinct())') was evaluated as ('' != 'true' and 'Gradient.cpp' != 'Gradient.cpp' and '.\x64\Debug\' == '.\x64\Debug\').
10>  Task "VCMessage" skipped, due to false condition; ('%(ClCompile.ExcludedFromBuild)' != 'true' and '%(Filename)%(Extension)' != '@(ClCompile->'%(Filename)%(Extension)')' and '%(ObjectFileName)' == '@(ClCompile->Metadata(ObjectFileName)->Distinct())') was evaluated as ('' != 'true' and 'GradientCtrl.cpp' != 'GradientCtrl.cpp' and '.\x64\Debug\' == '.\x64\Debug\').
10>  Task "VCMessage" skipped, due to false condition; ('%(ClCompile.ExcludedFromBuild)' != 'true' and '%(Filename)%(Extension)' != '@(ClCompile->'%(Filename)%(Extension)')' and '%(ObjectFileName)' == '@(ClCompile->Metadata(ObjectFileName)->Distinct())') was evaluated as ('' != 'true' and 'GradientCtrlImpl.cpp' != 'GradientCtrlImpl.cpp' and '.\x64\Debug\' == '.\x64\Debug\').
10>  Task "VCMessage" skipped, due to false condition; ('%(ClCompile.ExcludedFromBuild)' != 'true' and '%(Filename)%(Extension)' != '@(ClCompile->'%(Filename)%(Extension)')' and '%(ObjectFileName)' == '@(ClCompile->Metadata(ObjectFileName)->Distinct())') was evaluated as ('' != 'true' and 'Label.cpp' != 'Label.cpp' and '.\x64\Debug\' == '.\x64\Debug\').
10>  Task "VCMessage" skipped, due to false condition; ('%(ClCompile.ExcludedFromBuild)' != 'true' and '%(Filename)%(Extension)' != '@(ClCompile->'%(Filename)%(Extension)')' and '%(ObjectFileName)' == '@(ClCompile->Metadata(ObjectFileName)->Distinct())') was evaluated as ('' != 'true' and 'ListViewCtrlEx.cpp' != 'ListViewCtrlEx.cpp' and '.\x64\Debug\' == '.\x64\Debug\').
10>  Task "VCMessage" skipped, due to false condition; ('%(ClCompile.ExcludedFromBuild)' != 'true' and '%(Filename)%(Extension)' != '@(ClCompile->'%(Filename)%(Extension)')' and '%(ObjectFileName)' == '@(ClCompile->Metadata(ObjectFileName)->Distinct())') was evaluated as ('' != 'true' and 'Registry.cpp' != 'Registry.cpp' and '.\x64\Debug\' == '.\x64\Debug\').
10>  Task "VCMessage" skipped, due to false condition; ('%(ClCompile.ExcludedFromBuild)' != 'true' and '%(Filename)%(Extension)' != '@(ClCompile->'%(Filename)%(Extension)')' and '%(ObjectFileName)' == '@(ClCompile->Metadata(ObjectFileName)->Distinct())') was evaluated as ('' != 'true' and 'RegMFC.cpp' != 'RegMFC.cpp' and '.\x64\Debug\' == '.\x64\Debug\').
10>  Task "VCMessage" skipped, due to false condition; ('%(ClCompile.ExcludedFromBuild)' != 'true' and '%(Filename)%(Extension)' != '@(ClCompile->'%(Filename)%(Extension)')' and '%(ObjectFileName)' == '@(ClCompile->Metadata(ObjectFileName)->Distinct())') was evaluated as ('' != 'true' and 'RichToolTipCtrl.cpp' != 'RichToolTipCtrl.cpp' and '.\x64\Debug\' == '.\x64\Debug\').
10>  Task "VCMessage" skipped, due to false condition; ('%(ClCompile.ExcludedFromBuild)' != 'true' and '%(Filename)%(Extension)' != '@(ClCompile->'%(Filename)%(Extension)')' and '%(ObjectFileName)' == '@(ClCompile->Metadata(ObjectFileName)->Distinct())') was evaluated as ('' != 'true' and 'ScrollDialog.cpp' != 'ScrollDialog.cpp' and '.\x64\Debug\' == '.\x64\Debug\').
10>  Task "VCMessage" skipped, due to false condition; ('%(ClCompile.ExcludedFromBuild)' != 'true' and '%(Filename)%(Extension)' != '@(ClCompile->'%(Filename)%(Extension)')' and '%(ObjectFileName)' == '@(ClCompile->Metadata(ObjectFileName)->Distinct())') was evaluated as ('' != 'true' and 'SplitterControl.cpp' != 'SplitterControl.cpp' and '.\x64\Debug\' == '.\x64\Debug\').
10>  Task "VCMessage" skipped, due to false condition; ('%(ClCompile.ExcludedFromBuild)' != 'true' and '%(Filename)%(Extension)' != '@(ClCompile->'%(Filename)%(Extension)')' and '%(ObjectFileName)' == '@(ClCompile->Metadata(ObjectFileName)->Distinct())') was evaluated as ('' != 'true' and 'ThemeUtil.cpp' != 'ThemeUtil.cpp' and '.\x64\Debug\' == '.\x64\Debug\').
10>  Task "VCMessage" skipped, due to false condition; ('%(ClCompile.ExcludedFromBuild)' != 'true' and '%(Filename)%(Extension)' != '@(ClCompile->'%(Filename)%(Extension)')' and '%(ObjectFileName)' == '@(ClCompile->Metadata(ObjectFileName)->Distinct())') was evaluated as ('' != 'true' and 'ToolTipButton.cpp' != 'ToolTipButton.cpp' and '.\x64\Debug\' == '.\x64\Debug\').
10>  Task "VCMessage" skipped, due to false condition; ('%(ClCompile.ExcludedFromBuild)' != 'true' and '%(Filename)%(Extension)' != '@(ClCompile->'%(Filename)%(Extension)')' and '%(ObjectFileName)' == '@(ClCompile->Metadata(ObjectFileName)->Distinct())') was evaluated as ('' != 'true' and 'WndImage.cpp' != 'WndImage.cpp' and '.\x64\Debug\' == '.\x64\Debug\').
10>  Task "VCMessage" skipped, due to false condition; ('%(ClCompile.ExcludedFromBuild)' != 'true' and '%(Filename)%(Extension)' != '@(ClCompile->'%(Filename)%(Extension)')' and '%(ObjectFileName)' == '@(ClCompile->Metadata(ObjectFileName)->Distinct())') was evaluated as ('' != 'true' and 'About.cpp' != 'About.cpp' and '.\x64\Debug\' == '.\x64\Debug\').
10>  Task "VCMessage" skipped, due to false condition; ('%(ClCompile.ExcludedFromBuild)' != 'true' and '%(Filename)%(Extension)' != '@(ClCompile->'%(Filename)%(Extension)')' and '%(ObjectFileName)' == '@(ClCompile->Metadata(ObjectFileName)->Distinct())') was evaluated as ('' != 'true' and 'AHDDemosaicing.cpp' != 'AHDDemosaicing.cpp' and '.\x64\Debug\' == '.\x64\Debug\').
10>  Task "VCMessage" skipped, due to false condition; ('%(ClCompile.ExcludedFromBuild)' != 'true' and '%(Filename)%(Extension)' != '@(ClCompile->'%(Filename)%(Extension)')' and '%(ObjectFileName)' == '@(ClCompile->Metadata(ObjectFileName)->Distinct())') was evaluated as ('' != 'true' and 'AlignmentParameters.cpp' != 'AlignmentParameters.cpp' and '.\x64\Debug\' == '.\x64\Debug\').
10>  Task "VCMessage" skipped, due to false condition; ('%(ClCompile.ExcludedFromBuild)' != 'true' and '%(Filename)%(Extension)' != '@(ClCompile->'%(Filename)%(Extension)')' and '%(ObjectFileName)' == '@(ClCompile->Metadata(ObjectFileName)->Distinct())') was evaluated as ('' != 'true' and 'AskRegistering.cpp' != 'AskRegistering.cpp' and '.\x64\Debug\' == '.\x64\Debug\').
10>  Task "VCMessage" skipped, due to false condition; ('%(ClCompile.ExcludedFromBuild)' != 'true' and '%(Filename)%(Extension)' != '@(ClCompile->'%(Filename)%(Extension)')' and '%(ObjectFileName)' == '@(ClCompile->Metadata(ObjectFileName)->Distinct())') was evaluated as ('' != 'true' and 'BackgroundCalibration.cpp' != 'BackgroundCalibration.cpp' and '.\x64\Debug\' == '.\x64\Debug\').
10>  Task "VCMessage" skipped, due to false condition; ('%(ClCompile.ExcludedFromBuild)' != 'true' and '%(Filename)%(Extension)' != '@(ClCompile->'%(Filename)%(Extension)')' and '%(ObjectFileName)' == '@(ClCompile->Metadata(ObjectFileName)->Distinct())') was evaluated as ('' != 'true' and 'BackgroundLoading.cpp' != 'BackgroundLoading.cpp' and '.\x64\Debug\' == '.\x64\Debug\').
10>  Task "VCMessage" skipped, due to false condition; ('%(ClCompile.ExcludedFromBuild)' != 'true' and '%(Filename)%(Extension)' != '@(ClCompile->'%(Filename)%(Extension)')' and '%(ObjectFileName)' == '@(ClCompile->Metadata(ObjectFileName)->Distinct())') was evaluated as ('' != 'true' and 'BackgroundOptions.cpp' != 'BackgroundOptions.cpp' and '.\x64\Debug\' == '.\x64\Debug\').
10>  Task "VCMessage" skipped, due to false condition; ('%(ClCompile.ExcludedFromBuild)' != 'true' and '%(Filename)%(Extension)' != '@(ClCompile->'%(Filename)%(Extension)')' and '%(ObjectFileName)' == '@(ClCompile->Metadata(ObjectFileName)->Distinct())') was evaluated as ('' != 'true' and 'BatchStacking.cpp' != 'BatchStacking.cpp' and '.\x64\Debug\' == '.\x64\Debug\').
10>  Task "VCMessage" skipped, due to false condition; ('%(ClCompile.ExcludedFromBuild)' != 'true' and '%(Filename)%(Extension)' != '@(ClCompile->'%(Filename)%(Extension)')' and '%(ObjectFileName)' == '@(ClCompile->Metadata(ObjectFileName)->Distinct())') was evaluated as ('' != 'true' and 'BitmapExt.cpp' != 'BitmapExt.cpp' and '.\x64\Debug\' == '.\x64\Debug\').
10>  Task "VCMessage" skipped, due to false condition; ('%(ClCompile.ExcludedFromBuild)' != 'true' and '%(Filename)%(Extension)' != '@(ClCompile->'%(Filename)%(Extension)')' and '%(ObjectFileName)' == '@(ClCompile->Metadata(ObjectFileName)->Distinct())') was evaluated as ('' != 'true' and 'ChannelAlign.cpp' != 'ChannelAlign.cpp' and '.\x64\Debug\' == '.\x64\Debug\').
10>  Task "VCMessage" skipped, due to false condition; ('%(ClCompile.ExcludedFromBuild)' != 'true' and '%(Filename)%(Extension)' != '@(ClCompile->'%(Filename)%(Extension)')' and '%(ObjectFileName)' == '@(ClCompile->Metadata(ObjectFileName)->Distinct())') was evaluated as ('' != 'true' and 'CheckAbove.cpp' != 'CheckAbove.cpp' and '.\x64\Debug\' == '.\x64\Debug\').
10>  Task "VCMessage" skipped, due to false condition; ('%(ClCompile.ExcludedFromBuild)' != 'true' and '%(Filename)%(Extension)' != '@(ClCompile->'%(Filename)%(Extension)')' and '%(ObjectFileName)' == '@(ClCompile->Metadata(ObjectFileName)->Distinct())') was evaluated as ('' != 'true' and 'CometStacking.cpp' != 'CometStacking.cpp' and '.\x64\Debug\' == '.\x64\Debug\').
10>  Task "VCMessage" skipped, due to false condition; ('%(ClCompile.ExcludedFromBuild)' != 'true' and '%(Filename)%(Extension)' != '@(ClCompile->'%(Filename)%(Extension)')' and '%(ObjectFileName)' == '@(ClCompile->Metadata(ObjectFileName)->Distinct())') was evaluated as ('' != 'true' and 'CosmeticEngine.cpp' != 'CosmeticEngine.cpp' and '.\x64\Debug\' == '.\x64\Debug\').
10>  Task "VCMessage" skipped, due to false condition; ('%(ClCompile.ExcludedFromBuild)' != 'true' and '%(Filename)%(Extension)' != '@(ClCompile->'%(Filename)%(Extension)')' and '%(ObjectFileName)' == '@(ClCompile->Metadata(ObjectFileName)->Distinct())') was evaluated as ('' != 'true' and 'DarkFrame.cpp' != 'DarkFrame.cpp' and '.\x64\Debug\' == '.\x64\Debug\').
10>  Task "VCMessage" skipped, due to false condition; ('%(ClCompile.ExcludedFromBuild)' != 'true' and '%(Filename)%(Extension)' != '@(ClCompile->'%(Filename)%(Extension)')' and '%(ObjectFileName)' == '@(ClCompile->Metadata(ObjectFileName)->Distinct())') was evaluated as ('' != 'true' and 'DeBloom.cpp' != 'DeBloom.cpp' and '.\x64\Debug\' == '.\x64\Debug\').
10>  Task "VCMessage" skipped, due to false condition; ('%(ClCompile.ExcludedFromBuild)' != 'true' and '%(Filename)%(Extension)' != '@(ClCompile->'%(Filename)%(Extension)')' and '%(ObjectFileName)' == '@(ClCompile->Metadata(ObjectFileName)->Distinct())') was evaluated as ('' != 'true' and 'DeepSkyStacker.cpp' != 'DeepSkyStacker.cpp' and '.\x64\Debug\' == '.\x64\Debug\').
10>  Task "VCMessage" skipped, due to false condition; ('%(ClCompile.ExcludedFromBuild)' != 'true' and '%(Filename)%(Extension)' != '@(ClCompile->'%(Filename)%(Extension)')' and '%(ObjectFileName)' == '@(ClCompile->Metadata(ObjectFileName)->Distinct())') was evaluated as ('' != 'true' and 'DeepStack.cpp' != 'DeepStack.cpp' and '.\x64\Debug\' == '.\x64\Debug\').
10>  Task "VCMessage" skipped, due to false condition; ('%(ClCompile.ExcludedFromBuild)' != 'true' and '%(Filename)%(Extension)' != '@(ClCompile->'%(Filename)%(Extension)')' and '%(ObjectFileName)' == '@(ClCompile->Metadata(ObjectFileName)->Distinct())') was evaluated as ('' != 'true' and 'DeepStackerDlg.cpp' != 'DeepStackerDlg.cpp' and '.\x64\Debug\' == '.\x64\Debug\').
10>  Task "VCMessage" skipped, due to false condition; ('%(ClCompile.ExcludedFromBuild)' != 'true' and '%(Filename)%(Extension)' != '@(ClCompile->'%(Filename)%(Extension)')' and '%(ObjectFileName)' == '@(ClCompile->Metadata(ObjectFileName)->Distinct())') was evaluated as ('' != 'true' and 'Delaunay.cpp' != 'Delaunay.cpp' and '.\x64\Debug\' == '.\x64\Debug\').
10>  Task "VCMessage" skipped, due to false condition; ('%(ClCompile.ExcludedFromBuild)' != 'true' and '%(Filename)%(Extension)' != '@(ClCompile->'%(Filename)%(Extension)')' and '%(ObjectFileName)' == '@(ClCompile->Metadata(ObjectFileName)->Distinct())') was evaluated as ('' != 'true' and 'DropFilesDlg.cpp' != 'DropFilesDlg.cpp' and '.\x64\Debug\' == '.\x64\Debug\').
10>  Task "VCMessage" skipped, due to false condition; ('%(ClCompile.ExcludedFromBuild)' != 'true' and '%(Filename)%(Extension)' != '@(ClCompile->'%(Filename)%(Extension)')' and '%(ObjectFileName)' == '@(ClCompile->Metadata(ObjectFileName)->Distinct())') was evaluated as ('' != 'true' and 'EntropyInfo.cpp' != 'EntropyInfo.cpp' and '.\x64\Debug\' == '.\x64\Debug\').
10>  Task "VCMessage" skipped, due to false condition; ('%(ClCompile.ExcludedFromBuild)' != 'true' and '%(Filename)%(Extension)' != '@(ClCompile->'%(Filename)%(Extension)')' and '%(ObjectFileName)' == '@(ClCompile->Metadata(ObjectFileName)->Distinct())') was evaluated as ('' != 'true' and 'ExplorerBar.cpp' != 'ExplorerBar.cpp' and '.\x64\Debug\' == '.\x64\Debug\').
10>  Task "VCMessage" skipped, due to false condition; ('%(ClCompile.ExcludedFromBuild)' != 'true' and '%(Filename)%(Extension)' != '@(ClCompile->'%(Filename)%(Extension)')' and '%(ObjectFileName)' == '@(ClCompile->Metadata(ObjectFileName)->Distinct())') was evaluated as ('' != 'true' and 'FileProperty.cpp' != 'FileProperty.cpp' and '.\x64\Debug\' == '.\x64\Debug\').
10>  Task "VCMessage" skipped, due to false condition; ('%(ClCompile.ExcludedFromBuild)' != 'true' and '%(Filename)%(Extension)' != '@(ClCompile->'%(Filename)%(Extension)')' and '%(ObjectFileName)' == '@(ClCompile->Metadata(ObjectFileName)->Distinct())') was evaluated as ('' != 'true' and 'Filters.cpp' != 'Filters.cpp' and '.\x64\Debug\' == '.\x64\Debug\').
10>  Task "VCMessage" skipped, due to false condition; ('%(ClCompile.ExcludedFromBuild)' != 'true' and '%(Filename)%(Extension)' != '@(ClCompile->'%(Filename)%(Extension)')' and '%(ObjectFileName)' == '@(ClCompile->Metadata(ObjectFileName)->Distinct())') was evaluated as ('' != 'true' and 'FitsFilesTab.cpp' != 'FitsFilesTab.cpp' and '.\x64\Debug\' == '.\x64\Debug\').
10>  Task "VCMessage" skipped, due to false condition; ('%(ClCompile.ExcludedFromBuild)' != 'true' and '%(Filename)%(Extension)' != '@(ClCompile->'%(Filename)%(Extension)')' and '%(ObjectFileName)' == '@(ClCompile->Metadata(ObjectFileName)->Distinct())') was evaluated as ('' != 'true' and 'FITSUtil.cpp' != 'FITSUtil.cpp' and '.\x64\Debug\' == '.\x64\Debug\').
10>  Task "VCMessage" skipped, due to false condition; ('%(ClCompile.ExcludedFromBuild)' != 'true' and '%(Filename)%(Extension)' != '@(ClCompile->'%(Filename)%(Extension)')' and '%(ObjectFileName)' == '@(ClCompile->Metadata(ObjectFileName)->Distinct())') was evaluated as ('' != 'true' and 'FlatFrame.cpp' != 'FlatFrame.cpp' and '.\x64\Debug\' == '.\x64\Debug\').
10>  Task "VCMessage" skipped, due to false condition; ('%(ClCompile.ExcludedFromBuild)' != 'true' and '%(Filename)%(Extension)' != '@(ClCompile->'%(Filename)%(Extension)')' and '%(ObjectFileName)' == '@(ClCompile->Metadata(ObjectFileName)->Distinct())') was evaluated as ('' != 'true' and 'FrameInfo.cpp' != 'FrameInfo.cpp' and '.\x64\Debug\' == '.\x64\Debug\').
10>  Task "VCMessage" skipped, due to false condition; ('%(ClCompile.ExcludedFromBuild)' != 'true' and '%(Filename)%(Extension)' != '@(ClCompile->'%(Filename)%(Extension)')' and '%(ObjectFileName)' == '@(ClCompile->Metadata(ObjectFileName)->Distinct())') was evaluated as ('' != 'true' and 'FrameList.cpp' != 'FrameList.cpp' and '.\x64\Debug\' == '.\x64\Debug\').
10>  Task "VCMessage" skipped, due to false condition; ('%(ClCompile.ExcludedFromBuild)' != 'true' and '%(Filename)%(Extension)' != '@(ClCompile->'%(Filename)%(Extension)')' and '%(ObjectFileName)' == '@(ClCompile->Metadata(ObjectFileName)->Distinct())') was evaluated as ('' != 'true' and 'ImageSinks.cpp' != 'ImageSinks.cpp' and '.\x64\Debug\' == '.\x64\Debug\').
10>  Task "VCMessage" skipped, due to false condition; ('%(ClCompile.ExcludedFromBuild)' != 'true' and '%(Filename)%(Extension)' != '@(ClCompile->'%(Filename)%(Extension)')' and '%(ObjectFileName)' == '@(ClCompile->Metadata(ObjectFileName)->Distinct())') was evaluated as ('' != 'true' and 'IntermediateFiles.cpp' != 'IntermediateFiles.cpp' and '.\x64\Debug\' == '.\x64\Debug\').
10>  Task "VCMessage" skipped, due to false condition; ('%(ClCompile.ExcludedFromBuild)' != 'true' and '%(Filename)%(Extension)' != '@(ClCompile->'%(Filename)%(Extension)')' and '%(ObjectFileName)' == '@(ClCompile->Metadata(ObjectFileName)->Distinct())') was evaluated as ('' != 'true' and 'Library.cpp' != 'Library.cpp' and '.\x64\Debug\' == '.\x64\Debug\').
10>  Task "VCMessage" skipped, due to false condition; ('%(ClCompile.ExcludedFromBuild)' != 'true' and '%(Filename)%(Extension)' != '@(ClCompile->'%(Filename)%(Extension)')' and '%(ObjectFileName)' == '@(ClCompile->Metadata(ObjectFileName)->Distinct())') was evaluated as ('' != 'true' and 'LibraryDlg.cpp' != 'LibraryDlg.cpp' and '.\x64\Debug\' == '.\x64\Debug\').
10>  Task "VCMessage" skipped, due to false condition; ('%(ClCompile.ExcludedFromBuild)' != 'true' and '%(Filename)%(Extension)' != '@(ClCompile->'%(Filename)%(Extension)')' and '%(ObjectFileName)' == '@(ClCompile->Metadata(ObjectFileName)->Distinct())') was evaluated as ('' != 'true' and 'LuminanceTab.cpp' != 'LuminanceTab.cpp' and '.\x64\Debug\' == '.\x64\Debug\').
10>  Task "VCMessage" skipped, due to false condition; ('%(ClCompile.ExcludedFromBuild)' != 'true' and '%(Filename)%(Extension)' != '@(ClCompile->'%(Filename)%(Extension)')' and '%(ObjectFileName)' == '@(ClCompile->Metadata(ObjectFileName)->Distinct())') was evaluated as ('' != 'true' and 'MasterFrames.cpp' != 'MasterFrames.cpp' and '.\x64\Debug\' == '.\x64\Debug\').
10>  Task "VCMessage" skipped, due to false condition; ('%(ClCompile.ExcludedFromBuild)' != 'true' and '%(Filename)%(Extension)' != '@(ClCompile->'%(Filename)%(Extension)')' and '%(ObjectFileName)' == '@(ClCompile->Metadata(ObjectFileName)->Distinct())') was evaluated as ('' != 'true' and 'MatchingStars.cpp' != 'MatchingStars.cpp' and '.\x64\Debug\' == '.\x64\Debug\').
10>  Task "VCMessage" skipped, due to false condition; ('%(ClCompile.ExcludedFromBuild)' != 'true' and '%(Filename)%(Extension)' != '@(ClCompile->'%(Filename)%(Extension)')' and '%(ObjectFileName)' == '@(ClCompile->Metadata(ObjectFileName)->Distinct())') was evaluated as ('' != 'true' and 'MultiBitmapProcess.cpp' != 'MultiBitmapProcess.cpp' and '.\x64\Debug\' == '.\x64\Debug\').
10>  Task "VCMessage" skipped, due to false condition; ('%(ClCompile.ExcludedFromBuild)' != 'true' and '%(Filename)%(Extension)' != '@(ClCompile->'%(Filename)%(Extension)')' and '%(ObjectFileName)' == '@(ClCompile->Metadata(ObjectFileName)->Distinct())') was evaluated as ('' != 'true' and 'Multitask.cpp' != 'Multitask.cpp' and '.\x64\Debug\' == '.\x64\Debug\').
10>  Task "VCMessage" skipped, due to false condition; ('%(ClCompile.ExcludedFromBuild)' != 'true' and '%(Filename)%(Extension)' != '@(ClCompile->'%(Filename)%(Extension)')' and '%(ObjectFileName)' == '@(ClCompile->Metadata(ObjectFileName)->Distinct())') was evaluated as ('' != 'true' and 'OutputTab.cpp' != 'OutputTab.cpp' and '.\x64\Debug\' == '.\x64\Debug\').
10>  Task "VCMessage" skipped, due to false condition; ('%(ClCompile.ExcludedFromBuild)' != 'true' and '%(Filename)%(Extension)' != '@(ClCompile->'%(Filename)%(Extension)')' and '%(ObjectFileName)' == '@(ClCompile->Metadata(ObjectFileName)->Distinct())') was evaluated as ('' != 'true' and 'PCLTools.cpp' != 'PCLTools.cpp' and '.\x64\Debug\' == '.\x64\Debug\').
10>  Task "VCMessage" skipped, due to false condition; ('%(ClCompile.ExcludedFromBuild)' != 'true' and '%(Filename)%(Extension)' != '@(ClCompile->'%(Filename)%(Extension)')' and '%(ObjectFileName)' == '@(ClCompile->Metadata(ObjectFileName)->Distinct())') was evaluated as ('' != 'true' and 'PictureListCtrl.cpp' != 'PictureListCtrl.cpp' and '.\x64\Debug\' == '.\x64\Debug\').
10>  Task "VCMessage" skipped, due to false condition; ('%(ClCompile.ExcludedFromBuild)' != 'true' and '%(Filename)%(Extension)' != '@(ClCompile->'%(Filename)%(Extension)')' and '%(ObjectFileName)' == '@(ClCompile->Metadata(ObjectFileName)->Distinct())') was evaluated as ('' != 'true' and 'PostCalibration.cpp' != 'PostCalibration.cpp' and '.\x64\Debug\' == '.\x64\Debug\').
10>  Task "VCMessage" skipped, due to false condition; ('%(ClCompile.ExcludedFromBuild)' != 'true' and '%(Filename)%(Extension)' != '@(ClCompile->'%(Filename)%(Extension)')' and '%(ObjectFileName)' == '@(ClCompile->Metadata(ObjectFileName)->Distinct())') was evaluated as ('' != 'true' and 'ProcessingDlg.cpp' != 'ProcessingDlg.cpp' and '.\x64\Debug\' == '.\x64\Debug\').
10>  Task "VCMessage" skipped, due to false condition; ('%(ClCompile.ExcludedFromBuild)' != 'true' and '%(Filename)%(Extension)' != '@(ClCompile->'%(Filename)%(Extension)')' and '%(ObjectFileName)' == '@(ClCompile->Metadata(ObjectFileName)->Distinct())') was evaluated as ('' != 'true' and 'ProcessSettingsSheet.cpp' != 'ProcessSettingsSheet.cpp' and '.\x64\Debug\' == '.\x64\Debug\').
10>  Task "VCMessage" skipped, due to false condition; ('%(ClCompile.ExcludedFromBuild)' != 'true' and '%(Filename)%(Extension)' != '@(ClCompile->'%(Filename)%(Extension)')' and '%(ObjectFileName)' == '@(ClCompile->Metadata(ObjectFileName)->Distinct())') was evaluated as ('' != 'true' and 'ProgressDlg.cpp' != 'ProgressDlg.cpp' and '.\x64\Debug\' == '.\x64\Debug\').
10>  Task "VCMessage" skipped, due to false condition; ('%(ClCompile.ExcludedFromBuild)' != 'true' and '%(Filename)%(Extension)' != '@(ClCompile->'%(Filename)%(Extension)')' and '%(ObjectFileName)' == '@(ClCompile->Metadata(ObjectFileName)->Distinct())') was evaluated as ('' != 'true' and 'RawDDPSettings.cpp' != 'RawDDPSettings.cpp' and '.\x64\Debug\' == '.\x64\Debug\').
10>  Task "VCMessage" skipped, due to false condition; ('%(ClCompile.ExcludedFromBuild)' != 'true' and '%(Filename)%(Extension)' != '@(ClCompile->'%(Filename)%(Extension)')' and '%(ObjectFileName)' == '@(ClCompile->Metadata(ObjectFileName)->Distinct())') was evaluated as ('' != 'true' and 'RawFilesTab.cpp' != 'RawFilesTab.cpp' and '.\x64\Debug\' == '.\x64\Debug\').
10>  Task "VCMessage" skipped, due to false condition; ('%(ClCompile.ExcludedFromBuild)' != 'true' and '%(Filename)%(Extension)' != '@(ClCompile->'%(Filename)%(Extension)')' and '%(ObjectFileName)' == '@(ClCompile->Metadata(ObjectFileName)->Distinct())') was evaluated as ('' != 'true' and 'RAWUtils.cpp' != 'RAWUtils.cpp' and '.\x64\Debug\' == '.\x64\Debug\').
10>  Task "VCMessage" skipped, due to false condition; ('%(ClCompile.ExcludedFromBuild)' != 'true' and '%(Filename)%(Extension)' != '@(ClCompile->'%(Filename)%(Extension)')' and '%(ObjectFileName)' == '@(ClCompile->Metadata(ObjectFileName)->Distinct())') was evaluated as ('' != 'true' and 'RecommandedSettings.cpp' != 'RecommandedSettings.cpp' and '.\x64\Debug\' == '.\x64\Debug\').
10>  Task "VCMessage" skipped, due to false condition; ('%(ClCompile.ExcludedFromBuild)' != 'true' and '%(Filename)%(Extension)' != '@(ClCompile->'%(Filename)%(Extension)')' and '%(ObjectFileName)' == '@(ClCompile->Metadata(ObjectFileName)->Distinct())') was evaluated as ('' != 'true' and 'RegisterEngine.cpp' != 'RegisterEngine.cpp' and '.\x64\Debug\' == '.\x64\Debug\').
10>  Task "VCMessage" skipped, due to false condition; ('%(ClCompile.ExcludedFromBuild)' != 'true' and '%(Filename)%(Extension)' != '@(ClCompile->'%(Filename)%(Extension)')' and '%(ObjectFileName)' == '@(ClCompile->Metadata(ObjectFileName)->Distinct())') was evaluated as ('' != 'true' and 'RegisterSettings.cpp' != 'RegisterSettings.cpp' and '.\x64\Debug\' == '.\x64\Debug\').
10>  Task "VCMessage" skipped, due to false condition; ('%(ClCompile.ExcludedFromBuild)' != 'true' and '%(Filename)%(Extension)' != '@(ClCompile->'%(Filename)%(Extension)')' and '%(ObjectFileName)' == '@(ClCompile->Metadata(ObjectFileName)->Distinct())') was evaluated as ('' != 'true' and 'RegisterSettings_Actions.cpp' != 'RegisterSettings_Actions.cpp' and '.\x64\Debug\' == '.\x64\Debug\').
10>  Task "VCMessage" skipped, due to false condition; ('%(ClCompile.ExcludedFromBuild)' != 'true' and '%(Filename)%(Extension)' != '@(ClCompile->'%(Filename)%(Extension)')' and '%(ObjectFileName)' == '@(ClCompile->Metadata(ObjectFileName)->Distinct())') was evaluated as ('' != 'true' and 'RegisterSettings_Advanced.cpp' != 'RegisterSettings_Advanced.cpp' and '.\x64\Debug\' == '.\x64\Debug\').
10>  Task "VCMessage" skipped, due to false condition; ('%(ClCompile.ExcludedFromBuild)' != 'true' and '%(Filename)%(Extension)' != '@(ClCompile->'%(Filename)%(Extension)')' and '%(ObjectFileName)' == '@(ClCompile->Metadata(ObjectFileName)->Distinct())') was evaluated as ('' != 'true' and 'ResultParameters.cpp' != 'ResultParameters.cpp' and '.\x64\Debug\' == '.\x64\Debug\').
10>  Task "VCMessage" skipped, due to false condition; ('%(ClCompile.ExcludedFromBuild)' != 'true' and '%(Filename)%(Extension)' != '@(ClCompile->'%(Filename)%(Extension)')' and '%(ObjectFileName)' == '@(ClCompile->Metadata(ObjectFileName)->Distinct())') was evaluated as ('' != 'true' and 'RGBTab.cpp' != 'RGBTab.cpp' and '.\x64\Debug\' == '.\x64\Debug\').
10>  Task "VCMessage" skipped, due to false condition; ('%(ClCompile.ExcludedFromBuild)' != 'true' and '%(Filename)%(Extension)' != '@(ClCompile->'%(Filename)%(Extension)')' and '%(ObjectFileName)' == '@(ClCompile->Metadata(ObjectFileName)->Distinct())') was evaluated as ('' != 'true' and 'RunningStackingEngine.cpp' != 'RunningStackingEngine.cpp' and '.\x64\Debug\' == '.\x64\Debug\').
10>  Task "VCMessage" skipped, due to false condition; ('%(ClCompile.ExcludedFromBuild)' != 'true' and '%(Filename)%(Extension)' != '@(ClCompile->'%(Filename)%(Extension)')' and '%(ObjectFileName)' == '@(ClCompile->Metadata(ObjectFileName)->Distinct())') was evaluated as ('' != 'true' and 'SaturationTab.cpp' != 'SaturationTab.cpp' and '.\x64\Debug\' == '.\x64\Debug\').
10>  Task "VCMessage" skipped, due to false condition; ('%(ClCompile.ExcludedFromBuild)' != 'true' and '%(Filename)%(Extension)' != '@(ClCompile->'%(Filename)%(Extension)')' and '%(ObjectFileName)' == '@(ClCompile->Metadata(ObjectFileName)->Distinct())') was evaluated as ('' != 'true' and 'SaveEditChanges.cpp' != 'SaveEditChanges.cpp' and '.\x64\Debug\' == '.\x64\Debug\').
10>  Task "VCMessage" skipped, due to false condition; ('%(ClCompile.ExcludedFromBuild)' != 'true' and '%(Filename)%(Extension)' != '@(ClCompile->'%(Filename)%(Extension)')' and '%(ObjectFileName)' == '@(ClCompile->Metadata(ObjectFileName)->Distinct())') was evaluated as ('' != 'true' and 'SavePicture.cpp' != 'SavePicture.cpp' and '.\x64\Debug\' == '.\x64\Debug\').
10>  Task "VCMessage" skipped, due to false condition; ('%(ClCompile.ExcludedFromBuild)' != 'true' and '%(Filename)%(Extension)' != '@(ClCompile->'%(Filename)%(Extension)')' and '%(ObjectFileName)' == '@(ClCompile->Metadata(ObjectFileName)->Distinct())') was evaluated as ('' != 'true' and 'Settings.cpp' != 'Settings.cpp' and '.\x64\Debug\' == '.\x64\Debug\').
10>  Task "VCMessage" skipped, due to false condition; ('%(ClCompile.ExcludedFromBuild)' != 'true' and '%(Filename)%(Extension)' != '@(ClCompile->'%(Filename)%(Extension)')' and '%(ObjectFileName)' == '@(ClCompile->Metadata(ObjectFileName)->Distinct())') was evaluated as ('' != 'true' and 'SettingsDlg.cpp' != 'SettingsDlg.cpp' and '.\x64\Debug\' == '.\x64\Debug\').
10>  Task "VCMessage" skipped, due to false condition; ('%(ClCompile.ExcludedFromBuild)' != 'true' and '%(Filename)%(Extension)' != '@(ClCompile->'%(Filename)%(Extension)')' and '%(ObjectFileName)' == '@(ClCompile->Metadata(ObjectFileName)->Distinct())') was evaluated as ('' != 'true' and 'SetUILanguage.cpp' != 'SetUILanguage.cpp' and '.\x64\Debug\' == '.\x64\Debug\').
10>  Task "VCMessage" skipped, due to false condition; ('%(ClCompile.ExcludedFromBuild)' != 'true' and '%(Filename)%(Extension)' != '@(ClCompile->'%(Filename)%(Extension)')' and '%(ObjectFileName)' == '@(ClCompile->Metadata(ObjectFileName)->Distinct())') was evaluated as ('' != 'true' and 'StackedBitmap.cpp' != 'StackedBitmap.cpp' and '.\x64\Debug\' == '.\x64\Debug\').
10>  Task "VCMessage" skipped, due to false condition; ('%(ClCompile.ExcludedFromBuild)' != 'true' and '%(Filename)%(Extension)' != '@(ClCompile->'%(Filename)%(Extension)')' and '%(ObjectFileName)' == '@(ClCompile->Metadata(ObjectFileName)->Distinct())') was evaluated as ('' != 'true' and 'StackingDlg.cpp' != 'StackingDlg.cpp' and '.\x64\Debug\' == '.\x64\Debug\').
10>  Task "VCMessage" skipped, due to false condition; ('%(ClCompile.ExcludedFromBuild)' != 'true' and '%(Filename)%(Extension)' != '@(ClCompile->'%(Filename)%(Extension)')' and '%(ObjectFileName)' == '@(ClCompile->Metadata(ObjectFileName)->Distinct())') was evaluated as ('' != 'true' and 'StackingEngine.cpp' != 'StackingEngine.cpp' and '.\x64\Debug\' == '.\x64\Debug\').
10>  Task "VCMessage" skipped, due to false condition; ('%(ClCompile.ExcludedFromBuild)' != 'true' and '%(Filename)%(Extension)' != '@(ClCompile->'%(Filename)%(Extension)')' and '%(ObjectFileName)' == '@(ClCompile->Metadata(ObjectFileName)->Distinct())') was evaluated as ('' != 'true' and 'StackingParameters.cpp' != 'StackingParameters.cpp' and '.\x64\Debug\' == '.\x64\Debug\').
10>  Task "VCMessage" skipped, due to false condition; ('%(ClCompile.ExcludedFromBuild)' != 'true' and '%(Filename)%(Extension)' != '@(ClCompile->'%(Filename)%(Extension)')' and '%(ObjectFileName)' == '@(ClCompile->Metadata(ObjectFileName)->Distinct())') was evaluated as ('' != 'true' and 'StackingTasks.cpp' != 'StackingTasks.cpp' and '.\x64\Debug\' == '.\x64\Debug\').
10>  Task "VCMessage" skipped, due to false condition; ('%(ClCompile.ExcludedFromBuild)' != 'true' and '%(Filename)%(Extension)' != '@(ClCompile->'%(Filename)%(Extension)')' and '%(ObjectFileName)' == '@(ClCompile->Metadata(ObjectFileName)->Distinct())') was evaluated as ('' != 'true' and 'StackRecap.cpp' != 'StackRecap.cpp' and '.\x64\Debug\' == '.\x64\Debug\').
10>  Task "VCMessage" skipped, due to false condition; ('%(ClCompile.ExcludedFromBuild)' != 'true' and '%(Filename)%(Extension)' != '@(ClCompile->'%(Filename)%(Extension)')' and '%(ObjectFileName)' == '@(ClCompile->Metadata(ObjectFileName)->Distinct())') was evaluated as ('' != 'true' and 'StackSettings.cpp' != 'StackSettings.cpp' and '.\x64\Debug\' == '.\x64\Debug\').
10>  Task "VCMessage" skipped, due to false condition; ('%(ClCompile.ExcludedFromBuild)' != 'true' and '%(Filename)%(Extension)' != '@(ClCompile->'%(Filename)%(Extension)')' and '%(ObjectFileName)' == '@(ClCompile->Metadata(ObjectFileName)->Distinct())') was evaluated as ('' != 'true' and 'StarMask.cpp' != 'StarMask.cpp' and '.\x64\Debug\' == '.\x64\Debug\').
10>  Task "VCMessage" skipped, due to false condition; ('%(ClCompile.ExcludedFromBuild)' != 'true' and '%(Filename)%(Extension)' != '@(ClCompile->'%(Filename)%(Extension)')' and '%(ObjectFileName)' == '@(ClCompile->Metadata(ObjectFileName)->Distinct())') was evaluated as ('' != 'true' and 'StarMaskDlg.cpp' != 'StarMaskDlg.cpp' and '.\x64\Debug\' == '.\x64\Debug\').
10>  Task "VCMessage" skipped, due to false condition; ('%(ClCompile.ExcludedFromBuild)' != 'true' and '%(Filename)%(Extension)' != '@(ClCompile->'%(Filename)%(Extension)')' and '%(ObjectFileName)' == '@(ClCompile->Metadata(ObjectFileName)->Distinct())') was evaluated as ('' != 'true' and 'StdAfx.cpp' != 'StdAfx.cpp' and '.\x64\Debug\' == '.\x64\Debug\').
10>  Task "VCMessage" skipped, due to false condition; ('%(ClCompile.ExcludedFromBuild)' != 'true' and '%(Filename)%(Extension)' != '@(ClCompile->'%(Filename)%(Extension)')' and '%(ObjectFileName)' == '@(ClCompile->Metadata(ObjectFileName)->Distinct())') was evaluated as ('' != 'true' and 'TIFFUtil.cpp' != 'TIFFUtil.cpp' and '.\x64\Debug\' == '.\x64\Debug\').
10>  Task "VCMessage" skipped, due to false condition; ('%(ClCompile.ExcludedFromBuild)' != 'true' and '%(Filename)%(Extension)' != '@(ClCompile->'%(Filename)%(Extension)')' and '%(ObjectFileName)' == '@(ClCompile->Metadata(ObjectFileName)->Distinct())') was evaluated as ('' != 'true' and 'Workspace.cpp' != 'Workspace.cpp' and '.\x64\Debug\' == '.\x64\Debug\').
10>Target FixupCLCompileOptions:
10>Target MakeDirsForCl:
10>  Task "MakeDir"
10>  Done executing task "MakeDir".
10>Target "PrepareDirForCodeCoverage" skipped, due to false condition; ('$(CodeCoverageOperations)' != 'Disabled' AND '$(ProfileDirectory)' != '') was evaluated as ('Disabled' != 'Disabled' AND '.\x64\Debug\' != '').
10>Target "PrepareDirForPGO" skipped, due to false condition; ('$(ProfileGuidedOptimization)' != 'Disabled' AND '$(ProfileDirectory)' != '') was evaluated as ('Disabled' != 'Disabled' AND '.\x64\Debug\' != '').
10>Target "_SelectedFiles" skipped. Previously built successfully.
10>Target "ComputeMIDLGeneratedCompileInputs" skipped. Previously built successfully.
10>Target "ComputeCLInputPDBName" skipped. Previously built successfully.
10>Target "ComputeReferenceCLInput" skipped. Previously built successfully.
10>Target "WarnCompileDuplicatedFilename" skipped. Previously built successfully.
10>Target "FixupCLCompileOptions" skipped. Previously built successfully.
10>Target "_SelectedFiles" skipped. Previously built successfully.
10>Target SelectCustomBuild:
10>Target SelectClCompile:
10>Target CheckInstalledICLibsIPP:
10>  Task "ICMessage" skipped, due to false condition; ('$(IPPSingleThreaded)'=='0' AND '$(IPPMajorVersion)' != '' AND ('$(UseIntelIPP)' == 'Sequential' OR '$(UseIntelIPP)' == 'Sequential_Dynamic' OR ('$(UseIntelIPP)' == 'true' AND '%(ClCompile.OpenMP)' != 'GenerateParallelCode' AND '%(ClCompile.Parallelization)' != 'true'))) was evaluated as (''=='0' AND '' != '' AND ('false' == 'Sequential' OR 'false' == 'Sequential_Dynamic' OR ('false' == 'true' AND 'None' != 'GenerateParallelCode' AND 'false' != 'true'))).
10>  Task "ICMessage" skipped, due to false condition; ('$(IPPMultiThreaded)'=='0' AND '$(IPPMajorVersion)' != '' AND ('$(UseIntelIPP)' == 'Parallel_Static' OR '$(UseIntelIPP)' == 'Parallel_Dynamic' OR ('$(UseIntelIPP)' == 'true' AND ('%(ClCompile.OpenMP)' == 'GenerateParallelCode' OR '%(ClCompile.Parallelization)' == 'true')))) was evaluated as (''=='0' AND '' != '' AND ('false' == 'Parallel_Static' OR 'false' == 'Parallel_Dynamic' OR ('false' == 'true' AND ('None' == 'GenerateParallelCode' OR 'false' == 'true')))).
10>Target "SetICMKLEnvironment" skipped, due to false condition; ('$(UseIntelMKL)' != '' AND '$(UseIntelMKL)' != 'No' AND '$(MKLProductDir)' != '') was evaluated as ('No' != '' AND 'No' != 'No' AND '' != '').
10>Target "CheckInstalledICLibsMKL" skipped, due to false condition; ('$(UseIntelMKL)' != '' AND '$(UseIntelMKL)' != 'No') was evaluated as ('No' != '' AND 'No' != 'No').
10>Target "CheckInstalledVCLibsIPP" skipped, due to false condition; ('$(PlatformToolset)' == 'v141') was evaluated as ('Intel C++ Compiler 19.1' == 'v141').
10>Target "SetVCMKLEnvironment" skipped, due to false condition; ('$(UseIntelMKL)' != '' AND '$(UseIntelMKL)' != 'No' AND '$(PlatformToolset)' == 'v141' AND '$(MKLProductDir)' != '') was evaluated as ('No' != '' AND 'No' != 'No' AND 'Intel C++ Compiler 19.1' == 'v141' AND '' != '').
10>Target "CheckInstalledVCLibsMKL" skipped, due to false condition; ('$(UseIntelMKL)' != '' AND '$(UseIntelMKL)' != 'No' AND '$(PlatformToolset)' == 'v141') was evaluated as ('No' != '' AND 'No' != 'No' AND 'Intel C++ Compiler 19.1' == 'v141').
10>Target "GenerateTargetFrameworkMonikerAttribute" skipped, due to false condition; ('$(GenerateTargetFrameworkAttribute)' == 'true') was evaluated as ('false' == 'true').
10>Target "ManagedIncrementalBuildPreProcessDependencyGraph" skipped, due to false condition; ('@(ClCompile)' != '' and '$(EnableManagedIncrementalBuild)' == 'True') was evaluated as ('..\Tools\BitmapSlider.cpp;..\Tools\BtnST.cpp;..\Tools\ButtonToolbar.cpp;..\Tools\cdxCRot90DC.cpp;..\Tools\cdxCRotBevelLine.cpp;..\Tools\cgfiltyp.cpp;..\Tools\childprop.cpp;..\Tools\ControlPos.cpp;..\Tools\CtrlCache.cpp;..\Tools\CustomTabCtrl.cpp;..\Tools\FolderDlg.cpp;..\Tools\Gradient.cpp;..\Tools\GradientCtrl.cpp;..\Tools\GradientCtrlImpl.cpp;..\Tools\Label.cpp;..\Tools\ListViewCtrlEx.cpp;..\Tools\Registry.cpp;..\Tools\RegMFC.cpp;..\Tools\RichToolTipCtrl.cpp;..\Tools\ScrollDialog.cpp;..\Tools\SplitterControl.cpp;..\Tools\ThemeUtil.cpp;..\Tools\ToolTipButton.cpp;..\Tools\WndImage.cpp;About.cpp;AHDDemosaicing.cpp;AlignmentParameters.cpp;AskRegistering.cpp;BackgroundCalibration.cpp;BackgroundLoading.cpp;BackgroundOptions.cpp;BatchStacking.cpp;BitmapExt.cpp;ChannelAlign.cpp;CheckAbove.cpp;CometStacking.cpp;CosmeticEngine.cpp;DarkFrame.cpp;DeBloom.cpp;DeepSkyStacker.cpp;DeepStack.cpp;DeepStackerDlg.cpp;Delaunay.cpp;DropFilesDlg.cpp;EntropyInfo.cpp;ExplorerBar.cpp;FileProperty.cpp;Filters.cpp;FitsFilesTab.cpp;FITSUtil.cpp;FlatFrame.cpp;FrameInfo.cpp;FrameList.cpp;ImageSinks.cpp;IntermediateFiles.cpp;Library.cpp;LibraryDlg.cpp;LuminanceTab.cpp;MasterFrames.cpp;MatchingStars.cpp;MultiBitmapProcess.cpp;Multitask.cpp;OutputTab.cpp;PCLTools.cpp;PictureListCtrl.cpp;PostCalibration.cpp;ProcessingDlg.cpp;ProcessSettingsSheet.cpp;ProgressDlg.cpp;RawDDPSettings.cpp;RawFilesTab.cpp;RAWUtils.cpp;RecommandedSettings.cpp;RegisterEngine.cpp;RegisterSettings.cpp;RegisterSettings_Actions.cpp;RegisterSettings_Advanced.cpp;ResultParameters.cpp;RGBTab.cpp;RunningStackingEngine.cpp;SaturationTab.cpp;SaveEditChanges.cpp;SavePicture.cpp;Settings.cpp;SettingsDlg.cpp;SetUILanguage.cpp;StackedBitmap.cpp;StackingDlg.cpp;StackingEngine.cpp;StackingParameters.cpp;StackingTasks.cpp;StackRecap.cpp;StackSettings.cpp;StarMask.cpp;StarMaskDlg.cpp;StdAfx.cpp;TIFFUtil.cpp;Workspace.cpp' != '' and 'false' == 'True').
10>Target "CheckIntelEnvironmentForVCLibsDAAL" skipped, due to false condition; ('$(UseIntelDAAL)' != '' AND '$(UseIntelDAAL)' != 'false' AND '$(UseEnv)' != 'true' AND '$(PlatformToolset)' == 'v141') was evaluated as ('false' != '' AND 'false' != 'false' AND '' != 'true' AND 'Intel C++ Compiler 19.1' == 'v141').
10>Target "CheckIntelEnvironmentForVCLibsIPP" skipped, due to false condition; ('$(PlatformToolset)' == 'v141' AND '$(UseIntelIPP)' != '' AND '$(UseIntelIPP)' != 'false' AND '$(UseEnv)' != 'true') was evaluated as ('Intel C++ Compiler 19.1' == 'v141' AND 'false' != '' AND 'false' != 'false' AND '' != 'true').
10>Target "CheckIntelEnvironmentForVCLibsMKL" skipped, due to false condition; ('$(UseIntelMKL)' != '' AND '$(UseIntelMKL)' != 'No' AND '$(UseEnv)' != 'true' AND '$(PlatformToolset)' == 'v141') was evaluated as ('No' != '' AND 'No' != 'No' AND '' != 'true' AND 'Intel C++ Compiler 19.1' == 'v141').
10>Target "CheckIntelEnvironmentForVCLibsTBB" skipped, due to false condition; ('$(PlatformToolset)' == 'v141' AND '$(UseIntelTBB)' == 'true' AND '$(UseEnv)' != 'true') was evaluated as ('Intel C++ Compiler 19.1' == 'v141' AND 'false' == 'true' AND '' != 'true').
10>Target "CheckIntelEnvironmentForICLibsDAAL" skipped, due to false condition; ('$(UseIntelDAAL)' != '' AND '$(UseIntelDAAL)' != 'false' AND '$(UseEnv)' != 'true') was evaluated as ('false' != '' AND 'false' != 'false' AND '' != 'true').
10>Target "CheckIntelEnvironmentForICLibsIPP" skipped, due to false condition; ('$(UseIntelIPP)' != '' AND '$(UseIntelIPP)' != 'false' AND '$(UseEnv)' != 'true') was evaluated as ('false' != '' AND 'false' != 'false' AND '' != 'true').
10>Target "CheckIntelEnvironmentForICLibsMKL" skipped, due to false condition; ('$(UseIntelMKL)' != '' AND '$(UseIntelMKL)' != 'No' AND '$(UseEnv)' != 'true') was evaluated as ('No' != '' AND 'No' != 'No' AND '' != 'true').
10>Target "CheckIntelEnvironmentForICLibsTBB" skipped, due to false condition; ('$(UseIntelTBB)' == 'true' AND '$(UseEnv)' != 'true') was evaluated as ('false' == 'true' AND '' != 'true').
10>Target ClCompile:
10>  Task "Message"
10>    ***** ClCompile (x64 - Intel C++)
10>  Done executing task "Message".
10>  Task "Delete" skipped, due to false condition; ('%(ClCompile.DebugInformationFormat)' != '' AND '%(ClCompile.DebugInformationFormat)' != 'OldStyle' AND '%(ClCompile.ProgramDataBaseFileName)' != '' AND !Exists(%(ClCompile.ProgramDataBaseFileName))
10>               AND '%(ClCompile.UseMSVC)'!='true' AND '%(ClCompile.InterproceduralOptimization)'!='MultiFile' AND '%(ClCompile.LevelOfStaticAnalysis)'!='Brief' AND
10>               '%(ClCompile.LevelOfStaticAnalysis)'!='Medium' AND '%(ClCompile.LevelOfStaticAnalysis)'!='Verbose') was evaluated as ('ProgramDatabase' != '' AND 'ProgramDatabase' != 'OldStyle' AND 'C:\Users\amonra\Documents\GitHub\DSS\x64\Debug\DeepSkyStacker.pdb' != '' AND !Exists(C:\Users\amonra\Documents\GitHub\DSS\x64\Debug\DeepSkyStacker.pdb)
10>               AND 'false'!='true' AND 'NoIPO'!='MultiFile' AND 'None'!='Brief' AND
10>               'None'!='Medium' AND 'None'!='Verbose').
10>  Task "ICL" skipped, due to false condition; ('%(ClCompile.PrecompiledHeader)' == 'Create' AND '%(ClCompile.ExcludedFromBuild)'!='true' AND '%(ClCompile.UseMSVC)'!='true') was evaluated as ('Use' == 'Create' AND ''!='true' AND 'false'!='true').
10>  Using "ICL" task from assembly "C:\Program Files (x86)\Microsoft Visual Studio\2017\Community\Common7\IDE\VC\VCTargets\Intel.Build.ICLTasks.v150.dll".
10>  Task "ICL"
10>    Read Tracking Logs:
10>    	.\x64\Debug\DeepSkyStacker.tlog\icl.read.1.tlog
10>    	.\x64\Debug\DeepSkyStacker.tlog\icl-mcpcom.read.1.tlog
10>    Outputs for C:\USERS\AMONRA\DOCUMENTS\GITHUB\DSS\DEEPSKYSTACKER\STDAFX.CPP:
10>    	C:\USERS\AMONRA\DOCUMENTS\GITHUB\DSS\DEEPSKYSTACKER\X64\DEBUG\STDAFX.OBJ
10>    	C:\USERS\AMONRA\DOCUMENTS\GITHUB\DSS\DEEPSKYSTACKER\X64\DEBUG\DEEPSKYSTACKER.PCHI
10>    StdAfx.cpp will be compiled because it was not found in the tracking log.
10>    Environment Variables passed to tool:
10>      VS_UNICODE_OUTPUT=2288
10>    C:\Program Files (x86)\IntelSWTools\compilers_and_libraries_2020\windows\bin\Intel64\icl.exe /c /Qm64 /I"C:\Program Files (x86)\Visual Leak Detector\include" /I.\ /I../Libraw /I..\ZClass /I..\tools /I..\LibTIFF /I..\CFitsIO /I..\Zlib /I"C:\Program Files (x86)\Visual Leak Detector\include" /Zi /nologo /W3 /WX /MP /Od /Ob0 /D __INTEL_COMPILER=1910 /D _UNICODE /D UNICODE /D NOMINMAX /D LIBRAW_NODLL /D WIN32 /D _DEBUG /D _CRT_SECURE_NO_DEPRECATE /D USE_LIBTIFF_STATIC /D Z_TRACE_DEVELOP /D _VC80_UPGRADE=0x0600 /D _MBCS /D _AFXDLL /EHsc /RTC1 /MDd /GS /fp:precise /Zc:wchar_t /Zc:forScope /GR /Qstd=c++14 /Yc"stdafx.h" /Fp".\x64\Debug\DeepSkyStacker.pch" /Fo".\x64\Debug\\" /Fd"C:\Users\amonra\Documents\GitHub\DSS\x64\Debug\DeepSkyStacker.pdb" /TP /FC StdAfx.cpp
10>    Tracking command:
10>    C:\Program Files (x86)\Microsoft Visual Studio\2017\Community\MSBuild\15.0\Bin\Tracker.exe /d "C:\Program Files (x86)\MSBuild\15.0\FileTracker\FileTracker32.dll" /i C:\Users\amonra\Documents\GitHub\DSS\DeepSkyStacker\x64\Debug\DeepSkyStacker.tlog /r C:\USERS\AMONRA\DOCUMENTS\GITHUB\DSS\DEEPSKYSTACKER\STDAFX.CPP /b MSBuildConsole_CancelEvent8c2d7c7c6ea54eed8f62cd5cb66c1869  /c "C:\Program Files (x86)\IntelSWTools\compilers_and_libraries_2020\windows\bin\Intel64\icl.exe"  /c /Qm64 /I"C:\Program Files (x86)\Visual Leak Detector\include" /I.\ /I../Libraw /I..\ZClass /I..\tools /I..\LibTIFF /I..\CFitsIO /I..\Zlib /I"C:\Program Files (x86)\Visual Leak Detector\include" /Zi /nologo /W3 /WX /MP /Od /Ob0 /D __INTEL_COMPILER=1910 /D _UNICODE /D UNICODE /D NOMINMAX /D LIBRAW_NODLL /D WIN32 /D _DEBUG /D _CRT_SECURE_NO_DEPRECATE /D USE_LIBTIFF_STATIC /D Z_TRACE_DEVELOP /D _VC80_UPGRADE=0x0600 /D _MBCS /D _AFXDLL /EHsc /RTC1 /MDd /GS /fp:precise /Zc:wchar_t /Zc:forScope /GR /Qstd=c++14 /Yc"stdafx.h" /Fp".\x64\Debug\DeepSkyStacker.pch" /Fo".\x64\Debug\\" /Fd"C:\Users\amonra\Documents\GitHub\DSS\x64\Debug\DeepSkyStacker.pdb" /TP /FC StdAfx.cpp
10>    TRACKER : : error TRK0002: Failed to execute command: ""C:\Program Files (x86)\IntelSWTools\compilers_and_libraries_2020\windows\bin\Intel64\icl.exe" @C:\Users\amonra\AppData\Local\Temp\tmp62d68a95871943d7a8985004e1d65f7c.rsp". The parameter is incorrect.
10>
10>
10>    The command exited with code 2.
10>  Done executing task "ICL" -- FAILED.
10>Done building target "ClCompile" in project "DeepSkyStacker.vcxproj" -- FAILED.
10>
10>Done building project "DeepSkyStacker.vcxproj" -- FAILED.
10>
10>Build FAILED.
10>
10>TRACKER : : error TRK0002: Failed to execute command: ""C:\Program Files (x86)\IntelSWTools\compilers_and_libraries_2020\windows\bin\Intel64\icl.exe" @C:\Users\amonra\AppData\Local\Temp\tmp62d68a95871943d7a8985004e1d65f7c.rsp". The parameter is incorrect.
10>    0 Warning(s)
10>    1 Error(s)
10>
10>Time Elapsed 00:00:00.55
DPart1
Beginner
1,332 Views

Here's some MSBuild output that may help:

Target ClCompile:
10>  Task "Message"
10>    ***** ClCompile (x64 - Intel C++)
10>  Done executing task "Message".
10>  Task "Delete" skipped, due to false condition; ('%(ClCompile.DebugInformationFormat)' != '' AND '%(ClCompile.DebugInformationFormat)' != 'OldStyle' AND '%(ClCompile.ProgramDataBaseFileName)' != '' AND !Exists(%(ClCompile.ProgramDataBaseFileName))
10>               AND '%(ClCompile.UseMSVC)'!='true' AND '%(ClCompile.InterproceduralOptimization)'!='MultiFile' AND '%(ClCompile.LevelOfStaticAnalysis)'!='Brief' AND
10>               '%(ClCompile.LevelOfStaticAnalysis)'!='Medium' AND '%(ClCompile.LevelOfStaticAnalysis)'!='Verbose') was evaluated as ('ProgramDatabase' != '' AND 'ProgramDatabase' != 'OldStyle' AND 'C:\Users\amonra\Documents\GitHub\DSS\x64\Debug\DeepSkyStacker.pdb' != '' AND !Exists(C:\Users\amonra\Documents\GitHub\DSS\x64\Debug\DeepSkyStacker.pdb)
10>               AND 'false'!='true' AND 'NoIPO'!='MultiFile' AND 'None'!='Brief' AND
10>               'None'!='Medium' AND 'None'!='Verbose').
10>  Task "ICL" skipped, due to false condition; ('%(ClCompile.PrecompiledHeader)' == 'Create' AND '%(ClCompile.ExcludedFromBuild)'!='true' AND '%(ClCompile.UseMSVC)'!='true') was evaluated as ('Use' == 'Create' AND ''!='true' AND 'false'!='true').
10>  Using "ICL" task from assembly "C:\Program Files (x86)\Microsoft Visual Studio\2017\Community\Common7\IDE\VC\VCTargets\Intel.Build.ICLTasks.v150.dll".
10>  Task "ICL"
10>    Read Tracking Logs:
10>    	.\x64\Debug\DeepSkyStacker.tlog\icl.read.1.tlog
10>    	.\x64\Debug\DeepSkyStacker.tlog\icl-mcpcom.read.1.tlog
10>    Outputs for C:\USERS\AMONRA\DOCUMENTS\GITHUB\DSS\DEEPSKYSTACKER\STDAFX.CPP:
10>    	C:\USERS\AMONRA\DOCUMENTS\GITHUB\DSS\DEEPSKYSTACKER\X64\DEBUG\STDAFX.OBJ
10>    	C:\USERS\AMONRA\DOCUMENTS\GITHUB\DSS\DEEPSKYSTACKER\X64\DEBUG\DEEPSKYSTACKER.PCHI
10>    StdAfx.cpp will be compiled because it was not found in the tracking log.
10>    Environment Variables passed to tool:
10>      VS_UNICODE_OUTPUT=1912
10>    C:\Program Files (x86)\IntelSWTools\compilers_and_libraries_2020\windows\bin\Intel64\icl.exe /c /Qm64 /I"C:\Program Files (x86)\Visual Leak Detector\include" /I.\ /I../Libraw /I..\ZClass /I..\tools /I..\LibTIFF /I..\CFitsIO /I..\Zlib /I"C:\Program Files (x86)\Visual Leak Detector\include" /Zi /nologo /W3 /WX /MP /Od /Ob0 /D __INTEL_COMPILER=1910 /D _UNICODE /D UNICODE /D NOMINMAX /D LIBRAW_NODLL /D WIN32 /D _DEBUG /D _CRT_SECURE_NO_DEPRECATE /D USE_LIBTIFF_STATIC /D Z_TRACE_DEVELOP /D _VC80_UPGRADE=0x0600 /D _MBCS /D _AFXDLL /EHsc /RTC1 /MDd /GS /fp:precise /Zc:wchar_t /Zc:forScope /GR /Yc"stdafx.h" /Fp".\x64\Debug\DeepSkyStacker.pch" /Fo".\x64\Debug\\" /Fd"C:\Users\amonra\Documents\GitHub\DSS\x64\Debug\DeepSkyStacker.pdb" /TP /FC StdAfx.cpp
10>    Tracking command:
10>    C:\Program Files (x86)\Microsoft Visual Studio\2017\Community\MSBuild\15.0\Bin\Tracker.exe /d "C:\Program Files (x86)\MSBuild\15.0\FileTracker\FileTracker32.dll" /i C:\Users\amonra\Documents\GitHub\DSS\DeepSkyStacker\x64\Debug\DeepSkyStacker.tlog /r C:\USERS\AMONRA\DOCUMENTS\GITHUB\DSS\DEEPSKYSTACKER\STDAFX.CPP /b MSBuildConsole_CancelEvent87e97dd3b04943baa92e415f55178857  /c "C:\Program Files (x86)\IntelSWTools\compilers_and_libraries_2020\windows\bin\Intel64\icl.exe"  /c /Qm64 /I"C:\Program Files (x86)\Visual Leak Detector\include" /I.\ /I../Libraw /I..\ZClass /I..\tools /I..\LibTIFF /I..\CFitsIO /I..\Zlib /I"C:\Program Files (x86)\Visual Leak Detector\include" /Zi /nologo /W3 /WX /MP /Od /Ob0 /D __INTEL_COMPILER=1910 /D _UNICODE /D UNICODE /D NOMINMAX /D LIBRAW_NODLL /D WIN32 /D _DEBUG /D _CRT_SECURE_NO_DEPRECATE /D USE_LIBTIFF_STATIC /D Z_TRACE_DEVELOP /D _VC80_UPGRADE=0x0600 /D _MBCS /D _AFXDLL /EHsc /RTC1 /MDd /GS /fp:precise /Zc:wchar_t /Zc:forScope /GR /Yc"stdafx.h" /Fp".\x64\Debug\DeepSkyStacker.pch" /Fo".\x64\Debug\\" /Fd"C:\Users\amonra\Documents\GitHub\DSS\x64\Debug\DeepSkyStacker.pdb" /TP /FC StdAfx.cpp
10>    TRACKER : : error TRK0002: Failed to execute command: ""C:\Program Files (x86)\IntelSWTools\compilers_and_libraries_2020\windows\bin\Intel64\icl.exe" @C:\Users\amonra\AppData\Local\Temp\tmpd318524d19284c21b2737f5e940ee164.rsp". The parameter is incorrect.
10>
10>
10>    The command exited with code 2.
10>  Done executing task "ICL" -- FAILED.
10>Done building target "ClCompile" in project "DeepSkyStacker.vcxproj" -- FAILED.
10>
10>Done building project "DeepSkyStacker.vcxproj" -- FAILED.
10>
10>Build FAILED.
10>
10>TRACKER : : error TRK0002: Failed to execute command: ""C:\Program Files (x86)\IntelSWTools\compilers_and_libraries_2020\windows\bin\Intel64\icl.exe" @C:\Users\amonra\AppData\Local\Temp\tmpd318524d19284c21b2737f5e940ee164.rsp". The parameter is incorrect.
10>    0 Warning(s)
10>    1 Error(s)
10>
10>Time Elapsed 00:00:00.49
========== Build: 0 succeeded, 1 failed, 9 up-to-date, 0 skipped ==========
PrasanthD_intel
Moderator
1,293 Views

Hi David,

Thanks for reporting the error.

We are forwarding your query to the concerned team.

We will get back to you soon.


Regards

Prasanth



Viet_H_Intel
Moderator
1,290 Views

What MSVS 2017 update version are you using?


It seems that this is a problem with tracker.exe.

Will Stdafx.cpp compile if you do:

icl.exe /c /Qm64 /I"C:\Program Files (x86)\Visual Leak Detector\include" /I.\ /I../Libraw /I..\ZClass /I..\tools /I..\LibTIFF /I..\CFitsIO /I..\Zlib /I"C:\Program Files (x86)\Visual Leak Detector\include" /Zi /nologo /W3 /WX /MP /Od /Ob0 /D __INTEL_COMPILER=1910 /D _UNICODE /D UNICODE /D NOMINMAX /D LIBRAW_NODLL /D WIN32 /D _DEBUG /D _CRT_SECURE_NO_DEPRECATE /D USE_LIBTIFF_STATIC /D Z_TRACE_DEVELOP /D _VC80_UPGRADE=0x0600 /D _MBCS /D _AFXDLL /EHsc /RTC1 /MDd /GS /fp:precise /Zc:wchar_t /Zc:forScope /GR /Yc"stdafx.h" /Fp".\x64\Debug\DeepSkyStacker.pch" /Fo".\x64\Debug\\" /Fd"C:\Users\amonra\Documents\GitHub\DSS\x64\Debug\DeepSkyStacker.pdb" /TP /FC StdAfx.cpp


And does it work if you replace icl.exe with cl.exe?

cl.exe" @C:\Users\amonra\AppData\Local\Temp\tmpd318524d19284c21b2737f5e940ee164.rsp



DPart1
Beginner
1,285 Views

VS2017 Community edition 15.9.14

I can't compile the rsp file as it is deleted by MsBuild on completion of the failed build.

Copyright (C) 2009-2020 Intel Corporation. All rights reserved.
Intel(R) Inspector 2020 (build 604266)
Copyright (C) 2009-2020 Intel Corporation. All rights reserved.
Intel(R) Advisor 2020 (build 605410)

Intel(R) Trace Analyzer and Collector 2020 Update 1 for Windows* OS for Intel(R) 64 applications
Copyright (C) 1996-2020 Intel Corporation. All rights reserved.


Intel(R) MPI Library 2019 Update 7 for Windows* Target Build Environment for Intel(R) 64 applications
Copyright 2007-2020 Intel Corporation.

Copyright (C) 1985-2019 Intel Corporation. All rights reserved.
Intel(R) Compiler 19.1 Update 1 (package 216)

**********************************************************************
** Visual Studio 2017 Developer Command Prompt v15.9.14
** Copyright (c) 2017 Microsoft Corporation
**********************************************************************
[vcvarsall.bat] Environment initialized for: 'x64'

C:\Program Files (x86)\IntelSWTools>cd \users\amonra\Documents\GitHub\DSS\DeepSkyStacker

C:\Users\amonra\Documents\GitHub\DSS\DeepSkyStacker>icl.exe /c /Qm64 /I"C:\Program Files (x86)\Visual Leak Detector\include" /I.\ /I../Libraw /I..\ZClass /I..\tools /I..\LibTIFF /I..\CFitsIO /I..\Zlib /I"C:\Program Files (x86)\Visual Leak Detector\include" /Zi /nologo /W3 /WX /MP /Od /Ob0 /D __INTEL_COMPILER=1910 /D _UNICODE /D UNICODE /D NOMINMAX /D LIBRAW_NODLL /D WIN32 /D _DEBUG /D _CRT_SECURE_NO_DEPRECATE /D USE_LIBTIFF_STATIC /D Z_TRACE_DEVELOP /D _VC80_UPGRADE=0x0600 /D _MBCS /D _AFXDLL /EHsc /RTC1 /MDd /GS /fp:precise /Zc:wchar_t /Zc:forScope /GR /Yc"stdafx.h" /Fp".\x64\Debug\DeepSkyStacker.pch" /Fo".\x64\Debug\\" /Fd"C:\Users\amonra\Documents\GitHub\DSS\x64\Debug\DeepSkyStacker.pdb" /TP /FC StdAfx.cpp
StdAfx.cpp

C:\Users\amonra\Documents\GitHub\DSS\DeepSkyStacker>cl.exe /c /Qm64 /I"C:\Program Files (x86)\Visual Leak Detector\include" /I.\ /I../Libraw /I..\ZClass /I..\tools /I..\LibTIFF /I..\CFitsIO /I..\Zlib /I"C:\Program Files (x86)\Visual Leak Detector\include" /Zi /nologo /W3 /WX /MP /Od /Ob0 /D __INTEL_COMPILER=1910 /D _UNICODE /D UNICODE /D NOMINMAX /D LIBRAW_NODLL /D WIN32 /D _DEBUG /D _CRT_SECURE_NO_DEPRECATE /D USE_LIBTIFF_STATIC /D Z_TRACE_DEVELOP /D _VC80_UPGRADE=0x0600 /D _MBCS /D _AFXDLL /EHsc /RTC1 /MDd /GS /fp:precise /Zc:wchar_t /Zc:forScope /GR /Yc"stdafx.h" /Fp".\x64\Debug\DeepSkyStacker.pch" /Fo".\x64\Debug\\" /Fd"C:\Users\amonra\Documents\GitHub\DSS\x64\Debug\DeepSkyStacker.pdb" /TP /FC StdAfx.cpp
cl : Command line warning D9002 : ignoring unknown option '/Qm64'
StdAfx.cpp
c:\program files (x86)\intelswtools\compilers_and_libraries_2020.1.216\windows\compiler\include\math.h(145): fatal error C1021: invalid preprocessor command 'include_next'

Viet_H_Intel
Moderator
1,277 Views

looks like StdAfx.cpp were able to compile with Intel Compiler.


Could be that Tracker.exe doesn't support icl.exe?




DPart1
Beginner
1,267 Views

Surely you have that the wrong way about - isn't it your job to ensure that icl.exe is compatible with the tracker?

David

DPart1
Beginner
1,224 Views

Bump - is anyone in Parallel Studio land looking at this?   If not why not?

Thanks
David

Viet_H_Intel
Moderator
1,216 Views

I have been working with my team, seems like Tracker.exe isn't supported by ICL.


DPart1
Beginner
1,212 Views

Well that's a royal pain as it means I cannot build my projects using Intel Compiler

A Parallel Studio XE license I can't use doesn't feel like a good deal :(>

When might I expect a solution?

David

Viet_H_Intel
Moderator
1,206 Views

What do you see when you run: C:\temp> where icl?


Thanks,



DPart1
Beginner
1,197 Views

C:\Users\amonra>cd \temp

C:\temp>where icl
INFO: Could not find files for the given pattern(s).

C:\temp>

Viet_H_Intel
Moderator
1,194 Views

Please run "where icl" on a Windows which you can successfully execute icl

Viet_H_Intel
Moderator
1,193 Views

C:\temp>icl
Intel(R) C++ Intel(R) 64 Compiler for applications running on Intel(R) 64, Version 19.1.1.216 Build 20200306
Copyright (C) 1985-2020 Intel Corporation.  All rights reserved.

icl: command line error: no files specified; for help type "icl /help"

C:\temp>where icl
C:\Program Files (x86)\IntelSWTools\compilers_and_libraries_2020.1.216\windows\bin\intel64\icl.exe

C:\temp>

DPart1
Beginner
1,186 Views
Intel(R) Trace Analyzer and Collector 2020 Update 2 for Windows* OS for Intel(R) 64 applications
Copyright (C) 1996-2020 Intel Corporation. All rights reserved.


Intel(R) MPI Library 2019 Update 8 for Windows* Target Build Environment for Intel(R) 64 applications
Copyright 2007-2020 Intel Corporation.

Copyright (C) 1985-2019 Intel Corporation. All rights reserved.
Intel(R) Compiler 19.1 Update 2 (package 254)

**********************************************************************
** Visual Studio 2019 Developer Command Prompt v16.6.4
** Copyright (c) 2020 Microsoft Corporation
**********************************************************************
[vcvarsall.bat] Environment initialized for: 'x64'

C:\Program Files (x86)\IntelSWTools>where icl
C:\Program Files (x86)\IntelSWTools\compilers_and_libraries_2020.2.254\windows\bin\intel64\icl.exe

C:\Program Files (x86)\IntelSWTools>cd \temp

C:\temp>where icl
C:\Program Files (x86)\IntelSWTools\compilers_and_libraries_2020.2.254\windows\bin\intel64\icl.exe

C:\temp>
Viet_H_Intel
Moderator
1,166 Views

The ICL's directory differed between Tracker vs. the actual one, which is a problem in your env.

 

TRACKER : : error TRK0002: Failed to execute command: ""C:\Program Files (x86)\IntelSWTools\compilers_and_libraries_2020\windows\bin\Intel64\icl.exe"

 

C:\temp>where icl

C:\Program Files (x86)\IntelSWTools\compilers_and_libraries_2020.1.216\windows\bin\intel64\icl.exe

 

 

DPart1
Beginner
1,158 Views

No it's a problem with whatever the VS2017 integration did - I did nothing to specify that path that you say is incorrect - that will have been set by your Visual Studio integration code.

So, the problem is still in your court:

C:\Program Files (x86)\IntelSWTools>dir icl.exe /s
 Volume in drive C is Apollo
 Volume Serial Number is 172D-FED0

 Directory of C:\Program Files (x86)\IntelSWTools\compilers_and_libraries\windows\bin\intel64

23/06/2020  08:55         5,309,296 icl.exe
               1 File(s)      5,309,296 bytes

 Directory of C:\Program Files (x86)\IntelSWTools\compilers_and_libraries\windows\bin\intel64_ia32

23/06/2020  08:55         2,310,000 icl.exe
               1 File(s)      2,310,000 bytes

 Directory of C:\Program Files (x86)\IntelSWTools\compilers_and_libraries_2020\windows\bin\intel64

23/06/2020  08:55         5,309,296 icl.exe
               1 File(s)      5,309,296 bytes

 Directory of C:\Program Files (x86)\IntelSWTools\compilers_and_libraries_2020\windows\bin\intel64_ia32

23/06/2020  08:55         2,310,000 icl.exe
               1 File(s)      2,310,000 bytes

 Directory of C:\Program Files (x86)\IntelSWTools\compilers_and_libraries_2020.1.216\windows\bin\intel64

06/03/2020  19:32         4,868,464 icl.exe
               1 File(s)      4,868,464 bytes

 Directory of C:\Program Files (x86)\IntelSWTools\compilers_and_libraries_2020.1.216\windows\bin\intel64_ia32

06/03/2020  19:32         2,038,640 icl.exe
               1 File(s)      2,038,640 bytes

 Directory of C:\Program Files (x86)\IntelSWTools\compilers_and_libraries_2020.2.254\windows\bin\intel64

23/06/2020  08:55         5,309,296 icl.exe
               1 File(s)      5,309,296 bytes

 Directory of C:\Program Files (x86)\IntelSWTools\compilers_and_libraries_2020.2.254\windows\bin\intel64_ia32

23/06/2020  08:55         2,310,000 icl.exe
               1 File(s)      2,310,000 bytes

 Directory of C:\Program Files (x86)\IntelSWTools\parallel_studio_xe_2020\compilers_and_libraries_2020\windows\bin\intel64

23/06/2020  08:55         5,309,296 icl.exe
               1 File(s)      5,309,296 bytes

 Directory of C:\Program Files (x86)\IntelSWTools\parallel_studio_xe_2020\compilers_and_libraries_2020\windows\bin\intel64_ia32

23/06/2020  08:55         2,310,000 icl.exe
               1 File(s)      2,310,000 bytes

 Directory of C:\Program Files (x86)\IntelSWTools\parallel_studio_xe_2020.1.086\compilers_and_libraries_2020\windows\bin\intel64

06/03/2020  19:32         4,868,464 icl.exe
               1 File(s)      4,868,464 bytes

 Directory of C:\Program Files (x86)\IntelSWTools\parallel_studio_xe_2020.1.086\compilers_and_libraries_2020\windows\bin\intel64_ia32

06/03/2020  19:32         2,038,640 icl.exe
               1 File(s)      2,038,640 bytes

 Directory of C:\Program Files (x86)\IntelSWTools\parallel_studio_xe_2020.2.899\compilers_and_libraries_2020\windows\bin\intel64

23/06/2020  08:55         5,309,296 icl.exe
               1 File(s)      5,309,296 bytes

 Directory of C:\Program Files (x86)\IntelSWTools\parallel_studio_xe_2020.2.899\compilers_and_libraries_2020\windows\bin\intel64_ia32

23/06/2020  08:55         2,310,000 icl.exe
               1 File(s)      2,310,000 bytes

     Total Files Listed:
              14 File(s)     51,910,688 bytes
               0 Dir(s)  1,469,059,031,040 bytes free

C:\Program Files (x86)\IntelSWTools>

 

Viet_H_Intel
Moderator
1,151 Views

Let me get in touch with the integration team and will get back to you.

Thanks, 

Viet_H_Intel
Moderator
1,168 Views

The ICL's directory differed between Tracker vs. the actual one, which is a problem in your env.


TRACKER : : error TRK0002: Failed to execute command: ""C:\Program Files (x86)\IntelSWTools\compilers_and_libraries_2020\windows\bin\Intel64\icl.exe"


C:\temp>where icl

C:\Program Files (x86)\IntelSWTools\compilers_and_libraries_2020.1.216\windows\bin\intel64\icl.exe




Viet_H_Intel
Moderator
762 Views

Can you downgrade your VS2017 to versions which released before the compiler build date (e.g.  VS2017 version 15.9.12)?


Reply