Community
cancel
Showing results for 
Search instead for 
Did you mean: 
Highlighted
Employee
82 Views

Unable to install pyaudio or portaudio

Hello, 

I'm trying in use pyaudio to run one of my models but I keep getting errors on the install. 

@s099-n003:~$ pip3 install pyaudio
Collecting pyaudio
Using cached https://files.pythonhosted.org/packages/ab/42/b4f04721c5c5bfc196ce156b3c768998ef8c0ae3654ed29ea5020c...
Building wheels for collected packages: pyaudio
Running setup.py bdist_wheel for pyaudio ... error
Complete output from command /usr/bin/python3 -u -c "import setuptools, tokenize;__file__='/tmp/pip-build-3th0stxt/pyaudio/setup.py';f=getattr(tokenize, 'open', open)(__file__);code=f.read().replace('\r\n', '\n');f.close();exec(compile(code, __file__, 'exec'))" bdist_wheel -d /tmp/tmpurqhri6kpip-wheel- --python-tag cp36:
running bdist_wheel
running build
running build_py
creating build
creating build/lib.linux-x86_64-3.6
copying src/pyaudio.py -> build/lib.linux-x86_64-3.6
running build_ext
building '_portaudio' extension
creating build/temp.linux-x86_64-3.6
creating build/temp.linux-x86_64-3.6/src
x86_64-linux-gnu-gcc -pthread -DNDEBUG -g -fwrapv -O2 -Wall -g -fstack-protector-strong -Wformat -Werror=format-security-Wdate-time -D_FORTIFY_SOURCE=2 -fPIC -I/usr/include/python3.6m -c src/_portaudiomodule.c -o build/temp.linux-x86_64-3.6/src/_portaudiomodule.o
src/_portaudiomodule.c:29:10: fatal error: portaudio.h: No such file or directory
#include "portaudio.h"
^~~~~~~~~~~~~
compilation terminated.
error: command 'x86_64-linux-gnu-gcc' failed with exit status 1

----------------------------------------
Failed building wheel for pyaudio
Running setup.py clean for pyaudio
Failed to build pyaudio
Installing collected packages: pyaudio
Running setup.py install for pyaudio ... error
Complete output from command /usr/bin/python3 -u -c "import setuptools, tokenize;__file__='/tmp/pip-build-3th0stxt/pyaudio/setup.py';f=getattr(tokenize, 'open', open)(__file__);code=f.read().replace('\r\n', '\n');f.close();exec(compile(code,__file__, 'exec'))" install --record /tmp/pip-4c55z72g-record/install-record.txt --single-version-externally-managed --compile --user --prefix=:
running install
running build
running build_py
creating build
creating build/lib.linux-x86_64-3.6
copying src/pyaudio.py -> build/lib.linux-x86_64-3.6
running build_ext
building '_portaudio' extension
creating build/temp.linux-x86_64-3.6
creating build/temp.linux-x86_64-3.6/src
x86_64-linux-gnu-gcc -pthread -DNDEBUG -g -fwrapv -O2 -Wall -g -fstack-protector-strong -Wformat -Werror=format-security -Wdate-time -D_FORTIFY_SOURCE=2 -fPIC -I/usr/include/python3.6m -c src/_portaudiomodule.c -o build/temp.linux-x86_64-3.6/src/_portaudiomodule.o
src/_portaudiomodule.c:29:10: fatal error: portaudio.h: No such file or directory
#include "portaudio.h"
^~~~~~~~~~~~~
compilation terminated.
error: command 'x86_64-linux-gnu-gcc' failed with exit status 1

----------------------------------------
Command "/usr/bin/python3 -u -c "import setuptools, tokenize;__file__='/tmp/pip-build-3th0stxt/pyaudio/setup.py';f=getattr(tokenize, 'open', open)(__file__);code=f.read().replace('\r\n', '\n');f.close();exec(compile(code, __file__, 'exec'))" install --record /tmp/pip-4c55z72g-record/install-record.txt --single-version-externally-managed --compile --user --prefix=" failed with error code 1 in /tmp/pip-build-3th0stxt/pyaudio/

 

When I try to install portaudio to get pyaudio, it also fails:

@s099-n003:~$ pip3 install portaudio
Collecting portaudio
Exception:
Traceback (most recent call last):
File "/usr/lib/python3/dist-packages/pip/basecommand.py", line 215, in main
status = self.run(options, args)
File "/usr/lib/python3/dist-packages/pip/commands/install.py", line 353, in run
wb.build(autobuilding=True)
File "/usr/lib/python3/dist-packages/pip/wheel.py", line 749, in build
self.requirement_set.prepare_files(self.finder)
File "/usr/lib/python3/dist-packages/pip/req/req_set.py", line 380, in prepare_files
ignore_dependencies=self.ignore_dependencies))
File "/usr/lib/python3/dist-packages/pip/req/req_set.py", line 554, in _prepare_file
require_hashes
File "/usr/lib/python3/dist-packages/pip/req/req_install.py", line 278, in populate_link
self.link = finder.find_requirement(self, upgrade)
File "/usr/lib/python3/dist-packages/pip/index.py", line 465, in find_requirement
all_candidates = self.find_all_candidates(req.name)
File "/usr/lib/python3/dist-packages/pip/index.py", line 423, in find_all_candidates
for page in self._get_pages(url_locations, project_name):
File "/usr/lib/python3/dist-packages/pip/index.py", line 568, in _get_pages
page = self._get_page(location)
File "/usr/lib/python3/dist-packages/pip/index.py", line 683, in _get_page
return HTMLPage.get_page(link, session=self.session)
File "/usr/lib/python3/dist-packages/pip/index.py", line 795, in get_page
resp.raise_for_status()
File "/usr/share/python-wheels/requests-2.18.4-py2.py3-none-any.whl/requests/models.py", line 935, in raise_for_status
raise HTTPError(http_error_msg, response=self)
requests.exceptions.HTTPError: 404 Client Error: Not Found for url: https://pypi.org/simple/portaudio/

0 Kudos
0 Replies