Community
cancel
Showing results for 
Search instead for 
Did you mean: 
yusuf_m_
Beginner
33 Views

BUILD FAILED please help

Please help i have this probleme

FAILURE: Build failed with an exception.

* What went wrong:
Execution failed for task ':processArmv7ReleaseResources'.
> com.android.ide.common.process.ProcessException: org.gradle.process.internal.ExecException: Process 'command '.../android-sdk/build-tools/25.0.0/aapt'' finished with non-zero exit value 1

* Try:
Run with --stacktrace option to get the stack trace. Run with --debug option to get more log output.

BUILD FAILED

Total time: 32.663 secs
Stopped 0 compiler daemon(s).
Error: Error code 1 for command: .../cordova_project/platforms/android/gradlew with args: cdvBuildRelease,-b,.../cordova_project/platforms/android/build.gradle,--no-daemon,-Pandroid.useDeprecatedNdk=true,--info
Tags (2)
0 Kudos
3 Replies
PaulF_IntelCorp
Employee
33 Views

Please attach the detailed error log to your post as a txt file, the lines you posted are not sufficient to determine what might be wrong.

0 Kudos
Anthony_H_Intel
Employee
33 Views

Yusuf-

Please do attach the detailed error log as Paul requested.
I have a question, though - do you happen to have any ninepatch files in your project?


 

0 Kudos
Jerroyd_M_Intel
Employee
33 Views

Also, what is the list of plugins you've installed in your application?

0 Kudos