Community
cancel
Showing results for 
Search instead for 
Did you mean: 
Altenir_G_
Beginner
187 Views

Error: A build error occurred. Check the build log

https://am-xdk2.s3.amazonaws.com/cust.604f7b58-8cd6-4451-b3ff-b30690df364d/app.b4cea82a-b153-42cf-b8...

Calling plugman.fetch on plugin ".../cachedPlugins.mYjeCv.tmp/cache.xsk1O_.pl/cordova-plugin-statusbar"
Copying plugin ".../cachedPlugins.mYjeCv.tmp/cache.xsk1O_.pl/cordova-plugin-statusbar" => ".../cordova_project/plugins/cordova-plugin-statusbar"
Calling plugman.install on plugin ".../cordova_project/plugins/cordova-plugin-statusbar" for platform "android
Installing "cordova-plugin-statusbar" for android
Running command: .../cordova_project/platforms/android/cordova/version 
Command finished with error code 0: .../cordova_project/platforms/android/cordova/version 
Install start for "cordova-plugin-statusbar" on android.
Install complete for cordova-plugin-statusbar on android.
Checking for any plugins added to the project that have not been installed in android platform
No differences found between plugins added to project and installed in android platform. Continuing...
Generating config.xml from defaults for platform "android"
Wrote out Android application name to "Guarda Ponto"
Wrote out Android package name to "br.com.altenirgama.guardaponto"
This app does not have launcher icons defined
updated project successfully
Calling plugman.fetch on plugin ".../cachedPlugins.mYjeCv.tmp/cache.STxU4M.pl/cordova-plugin-device"
Copying plugin ".../cachedPlugins.mYjeCv.tmp/cache.STxU4M.pl/cordova-plugin-device" => ".../cordova_project/plugins/cordova-plugin-device"
Calling plugman.install on plugin ".../cordova_project/plugins/cordova-plugin-device" for platform "android
Installing "cordova-plugin-device" for android
Running command: .../cordova_project/platforms/android/cordova/version 
Command finished with error code 0: .../cordova_project/platforms/android/cordova/version 
Install start for "cordova-plugin-device" on android.
Install complete for cordova-plugin-device on android.
Checking for any plugins added to the project that have not been installed in android platform
No differences found between plugins added to project and installed in android platform. Continuing...
Generating config.xml from defaults for platform "android"
Wrote out Android application name to "Guarda Ponto"
Wrote out Android package name to "br.com.altenirgama.guardaponto"
This app does not have launcher icons defined
updated project successfully
Calling plugman.fetch on plugin ".../cachedPlugins.mYjeCv.tmp/cache.kr5t5c.pl/cordova-plugin-splashscreen"
Copying plugin ".../cachedPlugins.mYjeCv.tmp/cache.kr5t5c.pl/cordova-plugin-splashscreen" => ".../cordova_project/plugins/cordova-plugin-splashscreen"
Calling plugman.install on plugin ".../cordova_project/plugins/cordova-plugin-splashscreen" for platform "android
Installing "cordova-plugin-splashscreen" for android
Running command: .../cordova_project/platforms/android/cordova/version 
Command finished with error code 0: .../cordova_project/platforms/android/cordova/version 
Install start for "cordova-plugin-splashscreen" on android.
Install complete for cordova-plugin-splashscreen on android.
Checking for any plugins added to the project that have not been installed in android platform
No differences found between plugins added to project and installed in android platform. Continuing...
Generating config.xml from defaults for platform "android"
Wrote out Android application name to "Guarda Ponto"
Wrote out Android package name to "br.com.altenirgama.guardaponto"
This app does not have launcher icons defined
updated project successfully
Calling plugman.fetch on plugin ".../cachedPlugins.mYjeCv.tmp/cache.rJbOdw.pl/cordova-plugin-compat"
Copying plugin ".../cachedPlugins.mYjeCv.tmp/cache.rJbOdw.pl/cordova-plugin-compat" => ".../cordova_project/plugins/cordova-plugin-compat"
Calling plugman.install on plugin ".../cordova_project/plugins/cordova-plugin-compat" for platform "android
Installing "cordova-plugin-compat" for android
Running command: .../cordova_project/platforms/android/cordova/version 
Command finished with error code 0: .../cordova_project/platforms/android/cordova/version 
Install start for "cordova-plugin-compat" on android.
Install complete for cordova-plugin-compat on android.
Checking for any plugins added to the project that have not been installed in android platform
No differences found between plugins added to project and installed in android platform. Continuing...
Generating config.xml from defaults for platform "android"
Wrote out Android application name to "Guarda Ponto"
Wrote out Android package name to "br.com.altenirgama.guardaponto"
This app does not have launcher icons defined
updated project successfully
Calling plugman.fetch on plugin ".../cachedPlugins.mYjeCv.tmp/cache.QvRgoN.pl/cordova-plugin-camera"
Copying plugin ".../cachedPlugins.mYjeCv.tmp/cache.QvRgoN.pl/cordova-plugin-camera" => ".../cordova_project/plugins/cordova-plugin-camera"
Calling plugman.install on plugin ".../cordova_project/plugins/cordova-plugin-camera" for platform "android
Installing "cordova-plugin-camera" for android
Running command: .../cordova_project/platforms/android/cordova/version 
Command finished with error code 0: .../cordova_project/platforms/android/cordova/version 
Dependencies detected, iterating through them...
Plugin dependency "cordova-plugin-compat" already fetched, using that version.
Dependent plugin "cordova-plugin-compat" already installed on android.
Install start for "cordova-plugin-camera" on android.
Install complete for cordova-plugin-camera on android.
Checking for any plugins added to the project that have not been installed in android platform
No differences found between plugins added to project and installed in android platform. Continuing...
Generating config.xml from defaults for platform "android"
Wrote out Android application name to "Guarda Ponto"
Wrote out Android package name to "br.com.altenirgama.guardaponto"
This app does not have launcher icons defined
updated project successfully
Calling plugman.fetch on plugin ".../cachedPlugins.mYjeCv.tmp/cache.bnuUbf.pl/cordova-plugin-whitelist"
Copying plugin ".../cachedPlugins.mYjeCv.tmp/cache.bnuUbf.pl/cordova-plugin-whitelist" => ".../cordova_project/plugins/cordova-plugin-whitelist"
Calling plugman.install on plugin ".../cordova_project/plugins/cordova-plugin-whitelist" for platform "android
Installing "cordova-plugin-whitelist" for android
Running command: .../cordova_project/platforms/android/cordova/version 
Command finished with error code 0: .../cordova_project/platforms/android/cordova/version 
Install start for "cordova-plugin-whitelist" on android.
Install complete for cordova-plugin-whitelist on android.

               This plugin is only applicable for versions of cordova-android greater than 4.0. If you have a previous platform version, you do *not* need this plugin since the whitelist will be built in.
          
Checking for any plugins added to the project that have not been installed in android platform
No differences found between plugins added to project and installed in android platform. Continuing...
Generating config.xml from defaults for platform "android"
Wrote out Android application name to "Guarda Ponto"
Wrote out Android package name to "br.com.altenirgama.guardaponto"
This app does not have launcher icons defined
updated project successfully
Checking config.xml for saved platforms that haven't been added to the project
Checking for any plugins added to the project that have not been installed in android platform
No differences found between plugins added to project and installed in android platform. Continuing...
Generating config.xml from defaults for platform "android"
Wrote out Android application name to "Guarda Ponto"
Wrote out Android package name to "br.com.altenirgama.guardaponto"
This app does not have launcher icons defined
updated project successfully
Checking config.xml for saved plugins that haven't been added to the project
************* Processing the main config.xml file (after_prepare)  *****************
App Directory = [.../cordova_project]
Will process and update the following config files:
    Config.xml = [.../cordova_project/config.xml]
Namespaces:
    prefix/uri ''/'http://www.w3.org/ns/widgets'
    prefix/uri 'intelxdk'/'http://xdk.intel.com/ns/v1'
Android Manifest Namespaces:
    prefix/uri 'android'/'http://schemas.android.com/apk/res/android'
Name of the app is [Guarda Ponto]
Updating full app name to [Guarda Ponto]
Processing preference android-minSdkVersion [14]
Processing preference android-targetSdkVersion [21]
Processing preference android-installLocation [auto]
Processing preference permissions
Updating the versionCode
Updating the versionName
Processing debuggable
Added [{http://schemas.android.com/apk/res/android}debuggable] with [false]
Processing config file values
Saving config.xml to [.../cordova_project/config.xml]
************* Completed processing the main config.xml file (after_prepare)  *****************
ANDROID_HOME=.../android-sdk/
JAVA_HOME=/usr/lib/jvm/java-8-oracle-amd64
Downloading file://.../cordova/gradle/gradle-2.2.1-all.zip
..................................................................................................................................................................................................................................................................................................................................................................................................................................................................................................................................................................................................................................................................................................................................................................................................................................................................................................................................................................................................................................................................................................................................................................................................................................................................................................................................................................................................................................................................................................................................................................................................................................................................................................................................................................................................................................................................................................................................................................................................................................................................................................................................................................................................................................................................................................................................................................................................................................................................................................................................................................................................................................................................................................................................................................................................................................................................................................................................................................................................................................................
Unzipping /home/builduser/.gradle/wrapper/dists/gradle-2.2.1-all/3d6ng971birsf8vhjv1s2o93eu/gradle-2.2.1-all.zip to /home/builduser/.gradle/wrapper/dists/gradle-2.2.1-all/3d6ng971birsf8vhjv1s2o93eu
Set executable permissions for: /home/builduser/.gradle/wrapper/dists/gradle-2.2.1-all/3d6ng971birsf8vhjv1s2o93eu/gradle-2.2.1/bin/gradle
Starting Build
Compiling settings file '.../cordova_project/platforms/android/settings.gradle' using StatementExtractingScriptTransformer.
Compiling settings file '.../cordova_project/platforms/android/settings.gradle' using BuildScriptTransformer.
Settings evaluated using settings file '.../cordova_project/platforms/android/settings.gradle'.
Projects loaded. Root project using build file '.../cordova_project/platforms/android/build.gradle'.
Included projects: [root project 'android', project ':CordovaLib']
Evaluating root project 'android' using build file '.../cordova_project/platforms/android/build.gradle'.
Compiling build file '.../cordova_project/platforms/android/build.gradle' using StatementExtractingScriptTransformer.
Download https://repo1.maven.org/maven2/com/android/tools/build/gradle/1.5.0/gradle-1.5.0.pom
Download https://repo1.maven.org/maven2/com/android/tools/build/gradle-core/1.5.0/gradle-core-1.5.0.pom
Download https://repo1.maven.org/maven2/com/android/tools/build/builder/1.5.0/builder-1.5.0.pom
Download https://repo1.maven.org/maven2/com/android/tools/lint/lint/24.5.0/lint-24.5.0.pom
Download https://repo1.maven.org/maven2/com/android/tools/build/transform-api/1.5.0/transform-api-1.5.0.pom
Download https://repo1.maven.org/maven2/com/android/databinding/compilerCommon/1.0-rc5/compilerCommon-1.0-rc5...
Download https://repo1.maven.org/maven2/net/sf/proguard/proguard-gradle/5.2.1/proguard-gradle-5.2.1.pom
Download https://repo1.maven.org/maven2/net/sf/proguard/proguard-parent/5.2.1/proguard-parent-5.2.1.pom
Download https://repo1.maven.org/maven2/org/jacoco/org.jacoco.core/0.7.4.201502262128/org.jacoco.core-0.7.4.2...
Download https://repo1.maven.org/maven2/org/jacoco/org.jacoco.build/0.7.4.201502262128/org.jacoco.build-0.7.4...
Download https://repo1.maven.org/maven2/com/android/tools/build/builder-model/1.5.0/builder-model-1.5.0.pom
Download https://repo1.maven.org/maven2/com/android/tools/build/builder-test-api/1.5.0/builder-test-api-1.5.0...
Download https://repo1.maven.org/maven2/com/android/tools/sdklib/24.5.0/sdklib-24.5.0.pom
Download https://repo1.maven.org/maven2/com/android/tools/sdk-common/24.5.0/sdk-common-24.5.0.pom
Download https://repo1.maven.org/maven2/com/android/tools/common/24.5.0/common-24.5.0.pom
Download https://repo1.maven.org/maven2/com/android/tools/build/manifest-merger/24.5.0/manifest-merger-24.5.0...
Download https://repo1.maven.org/maven2/com/android/tools/ddms/ddmlib/24.5.0/ddmlib-24.5.0.pom
Download https://repo1.maven.org/maven2/com/android/tools/jack/jack-api/0.9.0/jack-api-0.9.0.pom
Download https://repo1.maven.org/maven2/com/android/tools/jill/jill-api/0.9.0/jill-api-0.9.0.pom
Download https://repo1.maven.org/maven2/com/squareup/javawriter/2.5.0/javawriter-2.5.0.pom
Download https://repo1.maven.org/maven2/org/sonatype/oss/oss-parent/7/oss-parent-7.pom
Download https://repo1.maven.org/maven2/org/bouncycastle/bcpkix-jdk15on/1.48/bcpkix-jdk15on-1.48.pom
Download https://repo1.maven.org/maven2/org/bouncycastle/bcprov-jdk15on/1.48/bcprov-jdk15on-1.48.pom
Download https://repo1.maven.org/maven2/org/ow2/asm/asm/5.0.3/asm-5.0.3.pom
Download https://repo1.maven.org/maven2/org/ow2/asm/asm-parent/5.0.3/asm-parent-5.0.3.pom
Download https://repo1.maven.org/maven2/org/ow2/ow2/1.3/ow2-1.3.pom
Download https://repo1.maven.org/maven2/org/ow2/asm/asm-tree/5.0.3/asm-tree-5.0.3.pom
Download https://repo1.maven.org/maven2/org/antlr/antlr-runtime/3.5.2/antlr-runtime-3.5.2.pom
Download https://repo1.maven.org/maven2/org/antlr/antlr-master/3.5.2/antlr-master-3.5.2.pom
Download https://repo1.maven.org/maven2/org/sonatype/oss/oss-parent/9/oss-parent-9.pom
Download https://repo1.maven.org/maven2/org/antlr/antlr/3.5.2/antlr-3.5.2.pom
Download https://repo1.maven.org/maven2/com/android/tools/lint/lint-checks/24.5.0/lint-checks-24.5.0.pom
Download https://repo1.maven.org/maven2/org/eclipse/jdt/core/compiler/ecj/4.4.2/ecj-4.4.2.pom
Download https://repo1.maven.org/maven2/com/android/tools/annotations/24.5.0/annotations-24.5.0.pom
Download https://repo1.maven.org/maven2/com/google/guava/guava/17.0/guava-17.0.pom
Download https://repo1.maven.org/maven2/com/google/guava/guava-parent/17.0/guava-parent-17.0.pom
Download https://repo1.maven.org/maven2/com/android/databinding/baseLibrary/1.0-rc5/baseLibrary-1.0-rc5.pom
Download https://repo1.maven.org/maven2/org/apache/commons/commons-lang3/3.3.2/commons-lang3-3.3.2.pom
Download https://repo1.maven.org/maven2/org/apache/commons/commons-parent/33/commons-parent-33.pom
Download https://repo1.maven.org/maven2/org/apache/apache/13/apache-13.pom
Download https://repo1.maven.org/maven2/com/tunnelvisionlabs/antlr4/4.5/antlr4-4.5.pom
Download https://repo1.maven.org/maven2/com/tunnelvisionlabs/antlr4-master/4.5/antlr4-master-4.5.pom
Download https://repo1.maven.org/maven2/commons-io/commons-io/2.4/commons-io-2.4.pom
Download https://repo1.maven.org/maven2/org/apache/commons/commons-parent/25/commons-parent-25.pom
Download https://repo1.maven.org/maven2/org/apache/apache/9/apache-9.pom
Download https://repo1.maven.org/maven2/com/googlecode/juniversalchardet/juniversalchardet/1.0.3/juniversalch...
Download https://repo1.maven.org/maven2/net/sf/proguard/proguard-base/5.2.1/proguard-base-5.2.1.pom
Download https://repo1.maven.org/maven2/org/ow2/asm/asm-debug-all/5.0.1/asm-debug-all-5.0.1.pom
Download https://repo1.maven.org/maven2/org/ow2/asm/asm-parent/5.0.1/asm-parent-5.0.1.pom
Download https://repo1.maven.org/maven2/com/android/tools/layoutlib/layoutlib-api/24.5.0/layoutlib-api-24.5.0...
Download https://repo1.maven.org/maven2/com/android/tools/dvlib/24.5.0/dvlib-24.5.0.pom
Download https://repo1.maven.org/maven2/com/google/code/gson/gson/2.2.4/gson-2.2.4.pom
Download https://repo1.maven.org/maven2/org/apache/commons/commons-compress/1.8.1/commons-compress-1.8.1.pom
Download https://repo1.maven.org/maven2/org/apache/httpcomponents/httpclient/4.1.1/httpclient-4.1.1.pom
Download https://repo1.maven.org/maven2/org/apache/httpcomponents/httpcomponents-client/4.1.1/httpcomponents-...
Download https://repo1.maven.org/maven2/org/apache/httpcomponents/project/4.1.1/project-4.1.1.pom
Download https://repo1.maven.org/maven2/org/apache/httpcomponents/httpmime/4.1/httpmime-4.1.pom
Download https://repo1.maven.org/maven2/org/apache/httpcomponents/httpcomponents-client/4.1/httpcomponents-cl...
Download https://repo1.maven.org/maven2/net/sf/kxml/kxml2/2.3.0/kxml2-2.3.0.pom
Download https://repo1.maven.org/maven2/org/antlr/ST4/4.0.8/ST4-4.0.8.pom
Download https://repo1.maven.org/maven2/com/android/tools/lint/lint-api/24.5.0/lint-api-24.5.0.pom
Download https://repo1.maven.org/maven2/org/ow2/asm/asm-analysis/5.0.3/asm-analysis-5.0.3.pom
Download https://repo1.maven.org/maven2/com/tunnelvisionlabs/antlr4-runtime/4.5/antlr4-runtime-4.5.pom
Download https://repo1.maven.org/maven2/com/tunnelvisionlabs/antlr4-annotations/4.5/antlr4-annotations-4.5.po...
Download https://repo1.maven.org/maven2/com/intellij/annotations/12.0/annotations-12.0.pom
Download https://repo1.maven.org/maven2/org/apache/httpcomponents/httpcore/4.1/httpcore-4.1.pom
Download https://repo1.maven.org/maven2/org/apache/httpcomponents/httpcomponents-core/4.1/httpcomponents-core...
Download https://repo1.maven.org/maven2/commons-logging/commons-logging/1.1.1/commons-logging-1.1.1.pom
Download https://repo1.maven.org/maven2/org/apache/commons/commons-parent/5/commons-parent-5.pom
Download https://repo1.maven.org/maven2/org/apache/apache/4/apache-4.pom
Download https://repo1.maven.org/maven2/commons-codec/commons-codec/1.4/commons-codec-1.4.pom
Download https://repo1.maven.org/maven2/org/apache/commons/commons-parent/11/commons-parent-11.pom
Download https://repo1.maven.org/maven2/com/android/tools/external/lombok/lombok-ast/0.2.3/lombok-ast-0.2.3.p...
Download https://repo1.maven.org/maven2/org/abego/treelayout/org.abego.treelayout.core/1.0.1/org.abego.treela...
Download https://repo1.maven.org/maven2/com/android/tools/build/gradle/1.5.0/gradle-1.5.0.jar
Download https://repo1.maven.org/maven2/com/android/tools/build/gradle-core/1.5.0/gradle-core-1.5.0.jar
Download https://repo1.maven.org/maven2/com/android/tools/build/builder/1.5.0/builder-1.5.0.jar
Download https://repo1.maven.org/maven2/com/android/tools/lint/lint/24.5.0/lint-24.5.0.jar
Download https://repo1.maven.org/maven2/com/android/tools/build/transform-api/1.5.0/transform-api-1.5.0.jar
Download https://repo1.maven.org/maven2/com/android/databinding/compilerCommon/1.0-rc5/compilerCommon-1.0-rc5...
Download https://repo1.maven.org/maven2/net/sf/proguard/proguard-gradle/5.2.1/proguard-gradle-5.2.1.jar
Download https://repo1.maven.org/maven2/org/jacoco/org.jacoco.core/0.7.4.201502262128/org.jacoco.core-0.7.4.2...
Download https://repo1.maven.org/maven2/com/android/tools/build/builder-model/1.5.0/builder-model-1.5.0.jar
Download https://repo1.maven.org/maven2/com/android/tools/build/builder-test-api/1.5.0/builder-test-api-1.5.0...
Download https://repo1.maven.org/maven2/com/android/tools/sdklib/24.5.0/sdklib-24.5.0.jar
Download https://repo1.maven.org/maven2/com/android/tools/sdk-common/24.5.0/sdk-common-24.5.0.jar
Download https://repo1.maven.org/maven2/com/android/tools/common/24.5.0/common-24.5.0.jar
Download https://repo1.maven.org/maven2/com/android/tools/build/manifest-merger/24.5.0/manifest-merger-24.5.0...
Download https://repo1.maven.org/maven2/com/android/tools/ddms/ddmlib/24.5.0/ddmlib-24.5.0.jar
Download https://repo1.maven.org/maven2/com/android/tools/jack/jack-api/0.9.0/jack-api-0.9.0.jar
Download https://repo1.maven.org/maven2/com/android/tools/jill/jill-api/0.9.0/jill-api-0.9.0.jar
Download https://repo1.maven.org/maven2/com/squareup/javawriter/2.5.0/javawriter-2.5.0.jar
Download https://repo1.maven.org/maven2/org/bouncycastle/bcpkix-jdk15on/1.48/bcpkix-jdk15on-1.48.jar
Download https://repo1.maven.org/maven2/org/bouncycastle/bcprov-jdk15on/1.48/bcprov-jdk15on-1.48.jar
Download https://repo1.maven.org/maven2/org/ow2/asm/asm/5.0.3/asm-5.0.3.jar
Download https://repo1.maven.org/maven2/org/ow2/asm/asm-tree/5.0.3/asm-tree-5.0.3.jar
Download https://repo1.maven.org/maven2/org/antlr/antlr-runtime/3.5.2/antlr-runtime-3.5.2.jar
Download https://repo1.maven.org/maven2/org/antlr/antlr/3.5.2/antlr-3.5.2.jar
Download https://repo1.maven.org/maven2/com/android/tools/lint/lint-checks/24.5.0/lint-checks-24.5.0.jar
Download https://repo1.maven.org/maven2/org/eclipse/jdt/core/compiler/ecj/4.4.2/ecj-4.4.2.jar
Download https://repo1.maven.org/maven2/com/android/tools/annotations/24.5.0/annotations-24.5.0.jar
Download https://repo1.maven.org/maven2/com/google/guava/guava/17.0/guava-17.0.jar
Download https://repo1.maven.org/maven2/com/android/databinding/baseLibrary/1.0-rc5/baseLibrary-1.0-rc5.jar
Download https://repo1.maven.org/maven2/org/apache/commons/commons-lang3/3.3.2/commons-lang3-3.3.2.jar
Download https://repo1.maven.org/maven2/com/tunnelvisionlabs/antlr4/4.5/antlr4-4.5.jar
Download https://repo1.maven.org/maven2/commons-io/commons-io/2.4/commons-io-2.4.jar
Download https://repo1.maven.org/maven2/com/googlecode/juniversalchardet/juniversalchardet/1.0.3/juniversalch...
Download https://repo1.maven.org/maven2/net/sf/proguard/proguard-base/5.2.1/proguard-base-5.2.1.jar
Download https://repo1.maven.org/maven2/org/ow2/asm/asm-debug-all/5.0.1/asm-debug-all-5.0.1.jar
Download https://repo1.maven.org/maven2/com/android/tools/layoutlib/layoutlib-api/24.5.0/layoutlib-api-24.5.0...
Download https://repo1.maven.org/maven2/com/android/tools/dvlib/24.5.0/dvlib-24.5.0.jar
Download https://repo1.maven.org/maven2/com/google/code/gson/gson/2.2.4/gson-2.2.4.jar
Download https://repo1.maven.org/maven2/org/apache/commons/commons-compress/1.8.1/commons-compress-1.8.1.jar
Download https://repo1.maven.org/maven2/org/apache/httpcomponents/httpclient/4.1.1/httpclient-4.1.1.jar
Download https://repo1.maven.org/maven2/org/apache/httpcomponents/httpmime/4.1/httpmime-4.1.jar
Download https://repo1.maven.org/maven2/net/sf/kxml/kxml2/2.3.0/kxml2-2.3.0.jar
Download https://repo1.maven.org/maven2/org/antlr/ST4/4.0.8/ST4-4.0.8.jar
Download https://repo1.maven.org/maven2/com/android/tools/lint/lint-api/24.5.0/lint-api-24.5.0.jar
Download https://repo1.maven.org/maven2/org/ow2/asm/asm-analysis/5.0.3/asm-analysis-5.0.3.jar
Download https://repo1.maven.org/maven2/com/tunnelvisionlabs/antlr4-runtime/4.5/antlr4-runtime-4.5.jar
Download https://repo1.maven.org/maven2/com/tunnelvisionlabs/antlr4-annotations/4.5/antlr4-annotations-4.5.ja...
Download https://repo1.maven.org/maven2/com/intellij/annotations/12.0/annotations-12.0.jar
Download https://repo1.maven.org/maven2/org/apache/httpcomponents/httpcore/4.1/httpcore-4.1.jar
Download https://repo1.maven.org/maven2/commons-logging/commons-logging/1.1.1/commons-logging-1.1.1.jar
Download https://repo1.maven.org/maven2/commons-codec/commons-codec/1.4/commons-codec-1.4.jar
Download https://repo1.maven.org/maven2/com/android/tools/external/lombok/lombok-ast/0.2.3/lombok-ast-0.2.3.j...
Download https://repo1.maven.org/maven2/org/abego/treelayout/org.abego.treelayout.core/1.0.1/org.abego.treela...
Compiling build file '.../cordova_project/platforms/android/build.gradle' using BuildScriptTransformer.
Creating configuration compile
Creating configuration apk
Creating configuration provided
Creating configuration wearApp
Creating configuration androidTestCompile
Creating configuration androidTestApk
Creating configuration androidTestProvided
Creating configuration androidTestWearApp
Creating configuration testCompile
Creating configuration testApk
Creating configuration testProvided
Creating configuration testWearApp
Creating configuration debugCompile
Creating configuration debugApk
Creating configuration debugProvided
Creating configuration debugWearApp
Creating configuration testDebugCompile
Creating configuration testDebugApk
Creating configuration testDebugProvided
Creating configuration testDebugWearApp
Creating configuration releaseCompile
Creating configuration releaseApk
Creating configuration releaseProvided
Creating configuration releaseWearApp
Creating configuration testReleaseCompile
Creating configuration testReleaseApk
Creating configuration testReleaseProvided
Creating configuration testReleaseWearApp
Compiling script '.../cordova_project/platforms/android/CordovaLib/cordova.gradle' using StatementExtractingScriptTransformer.
Compiling script '.../cordova_project/platforms/android/CordovaLib/cordova.gradle' using BuildScriptTransformer.
Evaluating project ':CordovaLib' using build file '.../cordova_project/platforms/android/CordovaLib/build.gradle'.
Compiling build file '.../cordova_project/platforms/android/CordovaLib/build.gradle' using StatementExtractingScriptTransformer.
Compiling build file '.../cordova_project/platforms/android/CordovaLib/build.gradle' using BuildScriptTransformer.
Creating configuration compile
Creating configuration publish
Creating configuration provided
Creating configuration wearApp
Creating configuration androidTestCompile
Creating configuration androidTestPublish
Creating configuration androidTestProvided
Creating configuration androidTestWearApp
Creating configuration testCompile
Creating configuration testPublish
Creating configuration testProvided
Creating configuration testWearApp
Creating configuration debugCompile
Creating configuration debugPublish
Creating configuration debugProvided
Creating configuration debugWearApp
Creating configuration testDebugCompile
Creating configuration testDebugPublish
Creating configuration testDebugProvided
Creating configuration testDebugWearApp
Creating configuration releaseCompile
Creating configuration releasePublish
Creating configuration releaseProvided
Creating configuration releaseWearApp
Creating configuration testReleaseCompile
Creating configuration testReleasePublish
Creating configuration testReleaseProvided
Creating configuration testReleaseWearApp
All projects evaluated.
Selected primary task 'cdvBuildRelease' from project :
Tasks to be executed: [task ':preBuild', task ':preReleaseBuild', task ':checkReleaseManifest', task ':CordovaLib:preBuild', task ':CordovaLib:preReleaseBuild', task ':CordovaLib:compileReleaseNdk', task ':CordovaLib:compileLint', task ':CordovaLib:copyReleaseLint', task ':CordovaLib:mergeReleaseProguardFiles', task ':CordovaLib:packageReleaseRenderscript', task ':CordovaLib:checkReleaseManifest', task ':CordovaLib:prepareReleaseDependencies', task ':CordovaLib:compileReleaseRenderscript', task ':CordovaLib:generateReleaseResValues', task ':CordovaLib:generateReleaseResources', task ':CordovaLib:packageReleaseResources', task ':CordovaLib:compileReleaseAidl', task ':CordovaLib:generateReleaseBuildConfig', task ':CordovaLib:generateReleaseAssets', task ':CordovaLib:mergeReleaseAssets', task ':CordovaLib:processReleaseManifest', task ':CordovaLib:processReleaseResources', task ':CordovaLib:generateReleaseSources', task ':CordovaLib:compileReleaseJavaWithJavac', task ':CordovaLib:processReleaseJavaRes', task ':CordovaLib:transformResourcesWithMergeJavaResForRelease', task ':CordovaLib:transformClassesAndResourcesWithSyncLibJarsForRelease', task ':CordovaLib:mergeReleaseJniLibFolders', task ':CordovaLib:transformNative_libsWithMergeJniLibsForRelease', task ':CordovaLib:transformNative_libsWithSyncJniLibsForRelease', task ':CordovaLib:bundleRelease', task ':prepareAndroidCordovaLibUnspecifiedReleaseLibrary', task ':prepareReleaseDependencies', task ':compileReleaseAidl', task ':compileReleaseRenderscript', task ':generateReleaseBuildConfig', task ':generateReleaseAssets', task ':mergeReleaseAssets', task ':generateReleaseResValues', task ':generateReleaseResources', task ':mergeReleaseResources', task ':processReleaseManifest', task ':processReleaseResources', task ':generateReleaseSources', task ':compileReleaseJavaWithJavac', task ':compileReleaseNdk', task ':compileReleaseSources', task ':transformClassesWithDexForRelease', task ':mergeReleaseJniLibFolders', task ':transformNative_libsWithMergeJniLibsForRelease', task ':processReleaseJavaRes', task ':transformResourcesWithMergeJavaResForRelease', task ':packageRelease', task ':assembleRelease', task ':cdvBuildRelease']
:preBuild (Thread[main,5,main]) started.
:preBuild
Skipping task ':preBuild' as it has no actions.
:preBuild UP-TO-DATE
:preBuild (Thread[main,5,main]) completed. Took 0.017 secs.
:preReleaseBuild (Thread[main,5,main]) started.
:preReleaseBuild
Skipping task ':preReleaseBuild' as it has no actions.
:preReleaseBuild UP-TO-DATE
:preReleaseBuild (Thread[main,5,main]) completed. Took 0.001 secs.
:checkReleaseManifest (Thread[main,5,main]) started.
:checkReleaseManifest
Executing task ':checkReleaseManifest' (up-to-date check took 0.0 secs) due to:
  Task has not declared any outputs.
:checkReleaseManifest (Thread[main,5,main]) completed. Took 0.002 secs.
:CordovaLib:preBuild (Thread[main,5,main]) started.
:CordovaLib:preBuild
Skipping task ':CordovaLib:preBuild' as it has no actions.
:CordovaLib:preBuild UP-TO-DATE
:CordovaLib:preBuild (Thread[main,5,main]) completed. Took 0.0 secs.
:CordovaLib:preReleaseBuild (Thread[main,5,main]) started.
:CordovaLib:preReleaseBuild
Skipping task ':CordovaLib:preReleaseBuild' as it has no actions.
:CordovaLib:preReleaseBuild UP-TO-DATE
:CordovaLib:preReleaseBuild (Thread[main,5,main]) completed. Took 0.0 secs.
:CordovaLib:compileReleaseNdk (Thread[main,5,main]) started.
:CordovaLib:compileReleaseNdk
Skipping task ':CordovaLib:compileReleaseNdk' as it has no source files.
:CordovaLib:compileReleaseNdk UP-TO-DATE
:CordovaLib:compileReleaseNdk (Thread[main,5,main]) completed. Took 0.001 secs.
:CordovaLib:compileLint (Thread[main,5,main]) started.
:CordovaLib:compileLint
Executing task ':CordovaLib:compileLint' (up-to-date check took 0.0 secs) due to:
  Task has not declared any outputs.
:CordovaLib:compileLint (Thread[main,5,main]) completed. Took 0.0 secs.
:CordovaLib:copyReleaseLint (Thread[main,5,main]) started.
:CordovaLib:copyReleaseLint
Skipping task ':CordovaLib:copyReleaseLint' as it has no source files.
:CordovaLib:copyReleaseLint UP-TO-DATE
:CordovaLib:copyReleaseLint (Thread[main,5,main]) completed. Took 0.001 secs.
:CordovaLib:mergeReleaseProguardFiles (Thread[main,5,main]) started.
:CordovaLib:mergeReleaseProguardFiles
Executing task ':CordovaLib:mergeReleaseProguardFiles' (up-to-date check took 0.009 secs) due to:
  No history is available.
:CordovaLib:mergeReleaseProguardFiles (Thread[main,5,main]) completed. Took 0.016 secs.
:CordovaLib:packageReleaseRenderscript (Thread[main,5,main]) started.
:CordovaLib:packageReleaseRenderscript
Skipping task ':CordovaLib:packageReleaseRenderscript' as it has no source files.
:CordovaLib:packageReleaseRenderscript UP-TO-DATE
:CordovaLib:packageReleaseRenderscript (Thread[main,5,main]) completed. Took 0.002 secs.
:CordovaLib:checkReleaseManifest (Thread[main,5,main]) started.
:CordovaLib:checkReleaseManifest
Executing task ':CordovaLib:checkReleaseManifest' (up-to-date check took 0.0 secs) due to:
  Task has not declared any outputs.
:CordovaLib:checkReleaseManifest (Thread[main,5,main]) completed. Took 0.001 secs.
:CordovaLib:prepareReleaseDependencies (Thread[main,5,main]) started.
:CordovaLib:prepareReleaseDependencies
Executing task ':CordovaLib:prepareReleaseDependencies' (up-to-date check took 0.0 secs) due to:
  Task has not declared any outputs.
:CordovaLib:prepareReleaseDependencies (Thread[main,5,main]) completed. Took 0.0 secs.
:CordovaLib:compileReleaseRenderscript (Thread[main,5,main]) started.
:CordovaLib:compileReleaseRenderscript
Executing task ':CordovaLib:compileReleaseRenderscript' (up-to-date check took 0.008 secs) due to:
  No history is available.
:CordovaLib:compileReleaseRenderscript (Thread[main,5,main]) completed. Took 0.037 secs.
:CordovaLib:generateReleaseResValues (Thread[main,5,main]) started.
:CordovaLib:generateReleaseResValues
Executing task ':CordovaLib:generateReleaseResValues' (up-to-date check took 0.001 secs) due to:
  No history is available.
:CordovaLib:generateReleaseResValues (Thread[main,5,main]) completed. Took 0.01 secs.
:CordovaLib:generateReleaseResources (Thread[main,5,main]) started.
:CordovaLib:generateReleaseResources
Skipping task ':CordovaLib:generateReleaseResources' as it has no actions.
:CordovaLib:generateReleaseResources (Thread[main,5,main]) completed. Took 0.0 secs.
:CordovaLib:packageReleaseResources (Thread[main,5,main]) started.
:CordovaLib:packageReleaseResources
Executing task ':CordovaLib:packageReleaseResources' (up-to-date check took 0.001 secs) due to:
  No history is available.
All input files are considered out-of-date for incremental task ':CordovaLib:packageReleaseResources'.
Unable do incremental execution: full task run
QueuedCruncher is using .../android-sdk/build-tools/25.0.0/aapt
:CordovaLib:packageReleaseResources (Thread[main,5,main]) completed. Took 0.027 secs.
:CordovaLib:compileReleaseAidl (Thread[main,5,main]) started.
:CordovaLib:compileReleaseAidl
Executing task ':CordovaLib:compileReleaseAidl' (up-to-date check took 0.001 secs) due to:
  No history is available.
All input files are considered out-of-date for incremental task ':CordovaLib:compileReleaseAidl'.
:CordovaLib:compileReleaseAidl (Thread[main,5,main]) completed. Took 0.007 secs.
:CordovaLib:generateReleaseBuildConfig (Thread[main,5,main]) started.
:CordovaLib:generateReleaseBuildConfig
Executing task ':CordovaLib:generateReleaseBuildConfig' (up-to-date check took 0.005 secs) due to:
  No history is available.
:CordovaLib:generateReleaseBuildConfig (Thread[main,5,main]) completed. Took 0.03 secs.
:CordovaLib:generateReleaseAssets (Thread[main,5,main]) started.
:CordovaLib:generateReleaseAssets
Skipping task ':CordovaLib:generateReleaseAssets' as it has no actions.
:CordovaLib:generateReleaseAssets UP-TO-DATE
:CordovaLib:generateReleaseAssets (Thread[main,5,main]) completed. Took 0.0 secs.
:CordovaLib:mergeReleaseAssets (Thread[main,5,main]) started.
:CordovaLib:mergeReleaseAssets
Executing task ':CordovaLib:mergeReleaseAssets' (up-to-date check took 0.001 secs) due to:
  No history is available.
All input files are considered out-of-date for incremental task ':CordovaLib:mergeReleaseAssets'.
Unable do incremental execution: full task run
:CordovaLib:mergeReleaseAssets (Thread[main,5,main]) completed. Took 0.013 secs.
:CordovaLib:processReleaseManifest (Thread[main,5,main]) started.
:CordovaLib:processReleaseManifest
Executing task ':CordovaLib:processReleaseManifest' (up-to-date check took 0.001 secs) due to:
  No history is available.
All input files are considered out-of-date for incremental task ':CordovaLib:processReleaseManifest'.
Merging main manifest .../cordova_project/platforms/android/CordovaLib/AndroidManifest.xml

Merging result:SUCCESS
Merged manifest saved to .../cordova_project/platforms/android/CordovaLib/build/intermediates/bundles/release/AndroidManifest.xml
:CordovaLib:processReleaseManifest (Thread[main,5,main]) completed. Took 0.054 secs.
:CordovaLib:processReleaseResources (Thread[main,5,main]) started.
:CordovaLib:processReleaseResources
Executing task ':CordovaLib:processReleaseResources' (up-to-date check took 0.001 secs) due to:
  No history is available.
All input files are considered out-of-date for incremental task ':CordovaLib:processReleaseResources'.
Starting process 'command '.../android-sdk/build-tools/25.0.0/aapt''. Working directory: .../cordova_project/platforms/android/CordovaLib Command: .../android-sdk/build-tools/25.0.0/aapt package -f --no-crunch -I .../android-sdk/platforms/android-23/android.jar -M .../cordova_project/platforms/android/CordovaLib/build/intermediates/bundles/release/aapt/AndroidManifest.xml -S .../cordova_project/platforms/android/CordovaLib/build/intermediates/bundles/release/res -A .../cordova_project/platforms/android/CordovaLib/build/intermediates/bundles/release/assets -m -J .../cordova_project/platforms/android/CordovaLib/build/generated/source/r/release --custom-package org.apache.cordova --non-constant-id -0 apk --output-text-symbols .../cordova_project/platforms/android/CordovaLib/build/intermediates/bundles/release
Successfully started process 'command '.../android-sdk/build-tools/25.0.0/aapt''
:CordovaLib:processReleaseResources (Thread[main,5,main]) completed. Took 0.372 secs.
:CordovaLib:generateReleaseSources (Thread[main,5,main]) started.
:CordovaLib:generateReleaseSources
Skipping task ':CordovaLib:generateReleaseSources' as it has no actions.
:CordovaLib:generateReleaseSources (Thread[main,5,main]) completed. Took 0.0 secs.
:CordovaLib:compileReleaseJavaWithJavac (Thread[main,5,main]) started.
:CordovaLib:compileReleaseJavaWithJavac
Executing task ':CordovaLib:compileReleaseJavaWithJavac' (up-to-date check took 0.005 secs) due to:
  No history is available.
All input files are considered out-of-date for incremental task ':CordovaLib:compileReleaseJavaWithJavac'.
Compiling with JDK Java compiler API.
Note: Some input files use or override a deprecated API.
Note: Recompile with -Xlint:deprecation for details.
:CordovaLib:compileReleaseJavaWithJavac (Thread[main,5,main]) completed. Took 1.657 secs.
:CordovaLib:processReleaseJavaRes (Thread[main,5,main]) started.
:CordovaLib:processReleaseJavaRes
Skipping task ':CordovaLib:processReleaseJavaRes' as it has no source files.
:CordovaLib:processReleaseJavaRes UP-TO-DATE
:CordovaLib:processReleaseJavaRes (Thread[main,5,main]) completed. Took 0.002 secs.
:CordovaLib:transformResourcesWithMergeJavaResForRelease (Thread[main,5,main]) started.
:CordovaLib:transformResourcesWithMergeJavaResForRelease
Executing task ':CordovaLib:transformResourcesWithMergeJavaResForRelease' (up-to-date check took 0.0 secs) due to:
  No history is available.
All input files are considered out-of-date for incremental task ':CordovaLib:transformResourcesWithMergeJavaResForRelease'.
:CordovaLib:transformResourcesWithMergeJavaResForRelease (Thread[main,5,main]) completed. Took 0.009 secs.
:CordovaLib:transformClassesAndResourcesWithSyncLibJarsForRelease (Thread[main,5,main]) started.
:CordovaLib:transformClassesAndResourcesWithSyncLibJarsForRelease
Executing task ':CordovaLib:transformClassesAndResourcesWithSyncLibJarsForRelease' (up-to-date check took 0.016 secs) due to:
  No history is available.
All input files are considered out-of-date for incremental task ':CordovaLib:transformClassesAndResourcesWithSyncLibJarsForRelease'.
:CordovaLib:transformClassesAndResourcesWithSyncLibJarsForRelease (Thread[main,5,main]) completed. Took 0.05 secs.
:CordovaLib:mergeReleaseJniLibFolders (Thread[main,5,main]) started.
:CordovaLib:mergeReleaseJniLibFolders
Executing task ':CordovaLib:mergeReleaseJniLibFolders' (up-to-date check took 0.001 secs) due to:
  No history is available.
All input files are considered out-of-date for incremental task ':CordovaLib:mergeReleaseJniLibFolders'.
Unable do incremental execution: full task run
:CordovaLib:mergeReleaseJniLibFolders (Thread[main,5,main]) completed. Took 0.005 secs.
:CordovaLib:transformNative_libsWithMergeJniLibsForRelease (Thread[main,5,main]) started.
:CordovaLib:transformNative_libsWithMergeJniLibsForRelease
Executing task ':CordovaLib:transformNative_libsWithMergeJniLibsForRelease' (up-to-date check took 0.001 secs) due to:
  No history is available.
All input files are considered out-of-date for incremental task ':CordovaLib:transformNative_libsWithMergeJniLibsForRelease'.
:CordovaLib:transformNative_libsWithMergeJniLibsForRelease (Thread[main,5,main]) completed. Took 0.003 secs.
:CordovaLib:transformNative_libsWithSyncJniLibsForRelease (Thread[main,5,main]) started.
:CordovaLib:transformNative_libsWithSyncJniLibsForRelease
Executing task ':CordovaLib:transformNative_libsWithSyncJniLibsForRelease' (up-to-date check took 0.001 secs) due to:
  No history is available.
All input files are considered out-of-date for incremental task ':CordovaLib:transformNative_libsWithSyncJniLibsForRelease'.
:CordovaLib:transformNative_libsWithSyncJniLibsForRelease (Thread[main,5,main]) completed. Took 0.002 secs.
:CordovaLib:bundleRelease (Thread[main,5,main]) started.
:CordovaLib:bundleRelease
Executing task ':CordovaLib:bundleRelease' (up-to-date check took 0.001 secs) due to:
  No history is available.
:CordovaLib:bundleRelease (Thread[main,5,main]) completed. Took 0.035 secs.
:prepareAndroidCordovaLibUnspecifiedReleaseLibrary (Thread[main,5,main]) started.
:prepareAndroidCordovaLibUnspecifiedReleaseLibrary
Executing task ':prepareAndroidCordovaLibUnspecifiedReleaseLibrary' (up-to-date check took 0.0 secs) due to:
  No history is available.
:prepareAndroidCordovaLibUnspecifiedReleaseLibrary (Thread[main,5,main]) completed. Took 0.032 secs.
:prepareReleaseDependencies (Thread[main,5,main]) started.
:prepareReleaseDependencies
Executing task ':prepareReleaseDependencies' (up-to-date check took 0.0 secs) due to:
  Task has not declared any outputs.
:prepareReleaseDependencies (Thread[main,5,main]) completed. Took 0.001 secs.
:compileReleaseAidl (Thread[main,5,main]) started.
:compileReleaseAidl
Executing task ':compileReleaseAidl' (up-to-date check took 0.002 secs) due to:
  No history is available.
All input files are considered out-of-date for incremental task ':compileReleaseAidl'.
:compileReleaseAidl (Thread[main,5,main]) completed. Took 0.004 secs.
:compileReleaseRenderscript (Thread[main,5,main]) started.
:compileReleaseRenderscript
Executing task ':compileReleaseRenderscript' (up-to-date check took 0.002 secs) due to:
  No history is available.
:compileReleaseRenderscript (Thread[main,5,main]) completed. Took 0.008 secs.
:generateReleaseBuildConfig (Thread[main,5,main]) started.
:generateReleaseBuildConfig
Executing task ':generateReleaseBuildConfig' (up-to-date check took 0.001 secs) due to:
  No history is available.
:generateReleaseBuildConfig (Thread[main,5,main]) completed. Took 0.005 secs.
:generateReleaseAssets (Thread[main,5,main]) started.
:generateReleaseAssets
Skipping task ':generateReleaseAssets' as it has no actions.
:generateReleaseAssets UP-TO-DATE
:generateReleaseAssets (Thread[main,5,main]) completed. Took 0.001 secs.
:mergeReleaseAssets (Thread[main,5,main]) started.
:mergeReleaseAssets
Executing task ':mergeReleaseAssets' (up-to-date check took 0.264 secs) due to:
  No history is available.
All input files are considered out-of-date for incremental task ':mergeReleaseAssets'.
Unable do incremental execution: full task run
:mergeReleaseAssets (Thread[main,5,main]) completed. Took 0.62 secs.
:generateReleaseResValues (Thread[main,5,main]) started.
:generateReleaseResValues
Executing task ':generateReleaseResValues' (up-to-date check took 0.0 secs) due to:
  No history is available.
:generateReleaseResValues (Thread[main,5,main]) completed. Took 0.003 secs.
:generateReleaseResources (Thread[main,5,main]) started.
:generateReleaseResources
Skipping task ':generateReleaseResources' as it has no actions.
:generateReleaseResources (Thread[main,5,main]) completed. Took 0.0 secs.
:mergeReleaseResources (Thread[main,5,main]) started.
:mergeReleaseResources
Executing task ':mergeReleaseResources' (up-to-date check took 0.011 secs) due to:
  No history is available.
All input files are considered out-of-date for incremental task ':mergeReleaseResources'.
Unable do incremental execution: full task run
QueuedCruncher is using .../android-sdk/build-tools/25.0.0/aapt
:mergeReleaseResources (Thread[main,5,main]) completed. Took 6.722 secs.
:processReleaseManifest (Thread[main,5,main]) started.
:processReleaseManifest
Executing task ':processReleaseManifest' (up-to-date check took 0.001 secs) due to:
  No history is available.
All input files are considered out-of-date for incremental task ':processReleaseManifest'.
Loading library manifest .../cordova_project/platforms/android/build/intermediates/exploded-aar/android/CordovaLib/unspecified/release/AndroidManifest.xml
Merging main manifest .../cordova_project/platforms/android/AndroidManifest.xml

Merging library manifest .../cordova_project/platforms/android/build/intermediates/exploded-aar/android/CordovaLib/unspecified/release/AndroidManifest.xml
Merging manifest with lower [android:CordovaLib:unspecified:release] AndroidManifest.xml:20:1-27:12
Merging uses-sdk with lower [android:CordovaLib:unspecified:release] AndroidManifest.xml:25:5-44
Merging result:SUCCESS
Merged manifest saved to .../cordova_project/platforms/android/build/intermediates/manifests/full/release/AndroidManifest.xml
:processReleaseManifest (Thread[main,5,main]) completed. Took 0.026 secs.
:processReleaseResources (Thread[main,5,main]) started.
:processReleaseResources
Executing task ':processReleaseResources' (up-to-date check took 0.036 secs) due to:
  No history is available.
All input files are considered out-of-date for incremental task ':processReleaseResources'.
Starting process 'command '.../android-sdk/build-tools/25.0.0/aapt''. Working directory: .../cordova_project/platforms/android Command: .../android-sdk/build-tools/25.0.0/aapt package -f --no-crunch -I .../android-sdk/platforms/android-23/android.jar -M .../cordova_project/platforms/android/build/intermediates/manifests/full/release/AndroidManifest.xml -S .../cordova_project/platforms/android/build/intermediates/res/merged/release -A .../cordova_project/platforms/android/build/intermediates/assets/release -m -J .../cordova_project/platforms/android/build/generated/source/r/release -F .../cordova_project/platforms/android/build/intermediates/res/resources-release.ap_ --custom-package br.com.altenirgama.guardaponto -0 apk --output-text-symbols .../cordova_project/platforms/android/build/intermediates/symbols/release
Successfully started process 'command '.../android-sdk/build-tools/25.0.0/aapt''
Unknown source file : .../cordova_project/platforms/android/build/intermediates/assets/release/www/bower_components/Materialize: error: Directory is case-insensitive equivalent to: .../cordova_project/platforms/android/build/intermediates/assets/release/www/bower_components/materialize

:processReleaseResources FAILED
:processReleaseResources (Thread[main,5,main]) completed. Took 0.068 secs.

FAILURE: Build failed with an exception.

* What went wrong:
Execution failed for task ':processReleaseResources'.
> com.android.ide.common.process.ProcessException: org.gradle.process.internal.ExecException: Process 'command '.../android-sdk/build-tools/25.0.0/aapt'' finished with non-zero exit value 1

* Try:
Run with --stacktrace option to get the stack trace. Run with --debug option to get more log output.

BUILD FAILED

Total time: 25.145 secs
Stopped 0 compiler daemon(s).
Error: Error code 1 for command: .../cordova_project/platforms/android/gradlew with args: cdvBuildRelease,-b,.../cordova_project/platforms/android/build.gradle,--no-daemon,-Pandroid.useDeprecatedNdk=true,--info
Tags (2)
0 Kudos
2 Replies
Shahab_L_Intel
Employee
187 Views

Hi Altenir,

This seems to be the relevant part: 

>>
Successfully started process 'command '.../android-sdk/build-tools/25.0.0/aapt''
Unknown source file : .../cordova_project/platforms/android/build/intermediates/assets/release/www/bower_components/Materialize: error: Directory is case-insensitive equivalent to: .../cordova_project/platforms/android/build/intermediates/assets/release/www/bower_components/materialize
<<
It looks like you have a 'materialize' and a 'Materialize' folder. Rename one of them to avoid the problem.
Altenir_G_
Beginner
187 Views

Solved

Thank you
Reply