Community
cancel
Showing results for 
Search instead for 
Did you mean: 
herb_r_
Beginner
86 Views

Samples run fine on Android but not IOS.

 

I am just starting with MOE.  I got the samples to run with android studio on Mac.  I want to run the same sampleson IOS.  I create a run configuration for my iPhone but there is nothing to select on the iOS SDK field.  Do I need to import something or deal with SDK manager?  Thanks for your help.  Technology looks good so far 

 

 

Tags (1)
0 Kudos
6 Replies
herb_r_
Beginner
86 Views

 

Original problem seemed to be some sort of conflict with android studio and MOE over the version of java.  All Java 8 now but there is another problem - SDKVERSION when I goto build iosBuildApp.

See below

15:28:38.547 SEVERE invoke(): org.intel.xrt_builder.BuildException: sdkVersion option is required!
    at org.intel.gradle.tasks.XRTBuildAppTask.configure(XRTBuildAppTask.java:23)
    at org.intel.gradle.tasks.XRTAbstractTask.invoke(XRTAbstractTask.java:45)
    at sun.reflect.NativeMethodAccessorImpl.invoke0(Native Method)
    at sun.reflect.NativeMethodAccessorImpl.invoke(NativeMethodAccessorImpl.java:62)
    at sun.reflect.DelegatingMethodAccessorImpl.invoke(DelegatingMethodAccessorImpl.java:43)
    at java.lang.reflect.Method.invoke(Method.java:498)
    at org.gradle.internal.reflect.JavaMethod.invoke(JavaMethod.java:63)
    at org.gradle.api.internal.project.taskfactory.AnnotationProcessingTaskFactory$StandardTaskAction.doExecute(AnnotationProcessingTaskFactory.java:218)
    at org.gradle.api.internal.project.taskfactory.AnnotationProcessingTaskFactory$StandardTaskAction.execute(AnnotationProcessingTaskFactory.java:211)
    at org.gradle.api.internal.project.taskfactory.AnnotationProcessingTaskFactory$StandardTaskAction.execute(AnnotationProcessingTaskFactory.java:200)
    at org.gradle.api.internal.AbstractTask$TaskActionWrapper.execute(AbstractTask.java:579)
    at org.gradle.api.internal.AbstractTask$TaskActionWrapper.execute(AbstractTask.java:562)
    at org.gradle.api.internal.tasks.execution.ExecuteActionsTaskExecuter.executeAction(ExecuteActionsTaskExecuter.java:80)
    at org.gradle.api.internal.tasks.execution.ExecuteActionsTaskExecuter.executeActions(ExecuteActionsTaskExecuter.java:61)
    at org.gradle.api.internal.tasks.execution.ExecuteActionsTaskExecuter.execute(ExecuteActionsTaskExecuter.java:46)
    at org.gradle.api.internal.tasks.execution.PostExecutionAnalysisTaskExecuter.execute(PostExecutionAnalysisTaskExecuter.java:35)
    at org.gradle.api.internal.tasks.execution.SkipUpToDateTaskExecuter.execute(SkipUpToDateTaskExecuter.java:64)
    at org.gradle.api.internal.tasks.execution.ValidatingTaskExecuter.execute(ValidatingTaskExecuter.java:58)
    at org.gradle.api.internal.tasks.execution.SkipEmptySourceFilesTaskExecuter.execute(SkipEmptySourceFilesTaskExecuter.java:42)
    at org.gradle.api.internal.tasks.execution.SkipTaskWithNoActionsExecuter.execute(SkipTaskWithNoActionsExecuter.java:52)
    at org.gradle.api.internal.tasks.execution.SkipOnlyIfTaskExecuter.execute(SkipOnlyIfTaskExecuter.java:53)
    at org.gradle.api.internal.tasks.execution.ExecuteAtMostOnceTaskExecuter.execute(ExecuteAtMostOnceTaskExecuter.java:43)
    at org.gradle.api.internal.AbstractTask.executeWithoutThrowingTaskFailure(AbstractTask.java:305)
    at org.gradle.execution.taskgraph.AbstractTaskPlanExecutor$TaskExecutorWorker.executeTask(AbstractTaskPlanExecutor.java:79)
    at org.gradle.execution.taskgraph.AbstractTaskPlanExecutor$TaskExecutorWorker.processTask(AbstractTaskPlanExecutor.java:63)
    at org.gradle.execution.taskgraph.AbstractTaskPlanExecutor$TaskExecutorWorker.run(AbstractTaskPlanExecutor.java:51)
    at org.gradle.execution.taskgraph.DefaultTaskPlanExecutor.process(DefaultTaskPlanExecutor.java:23)
    at org.gradle.execution.taskgraph.DefaultTaskGraphExecuter.execute(DefaultTaskGraphExecuter.java:88)
    at org.gradle.execution.SelectedTaskExecutionAction.execute(SelectedTaskExecutionAction.java:29)
    at org.gradle.execution.DefaultBuildExecuter.execute(DefaultBuildExecuter.java:62)
    at org.gradle.execution.DefaultBuildExecuter.access$200(DefaultBuildExecuter.java:23)
    at org.gradle.execution.DefaultBuildExecuter$2.proceed(DefaultBuildExecuter.java:68)
    at org.gradle.execution.DryRunBuildExecutionAction.execute(DryRunBuildExecutionAction.java:32)
    at org.gradle.execution.DefaultBuildExecuter.execute(DefaultBuildExecuter.java:62)
    at org.gradle.execution.DefaultBuildExecuter.execute(DefaultBuildExecuter.java:55)
    at org.gradle.initialization.DefaultGradleLauncher.doBuildStages(DefaultGradleLauncher.java:149)
    at org.gradle.initialization.DefaultGradleLauncher.doBuild(DefaultGradleLauncher.java:106)
    at org.gradle.initialization.DefaultGradleLauncher.run(DefaultGradleLauncher.java:86)
    at org.gradle.launcher.exec.InProcessBuildActionExecuter$DefaultBuildController.run(InProcessBuildActionExecuter.java:80)
    at org.gradle.launcher.cli.ExecuteBuildAction.run(ExecuteBuildAction.java:33)
    at org.gradle.launcher.cli.ExecuteBuildAction.run(ExecuteBuildAction.java:24)
    at org.gradle.launcher.exec.InProcessBuildActionExecuter.execute(InProcessBuildActionExecuter.java:36)
    at org.gradle.launcher.exec.InProcessBuildActionExecuter.execute(InProcessBuildActionExecuter.java:26)
    at org.gradle.launcher.cli.RunBuildAction.run(RunBuildAction.java:51)
    at org.gradle.internal.Actions$RunnableActionAdapter.execute(Actions.java:171)
    at org.gradle.launcher.cli.CommandLineActionFactory$ParseAndBuildAction.execute(CommandLineActionFactory.java:237)
    at org.gradle.launcher.cli.CommandLineActionFactory$ParseAndBuildAction.execute(CommandLineActionFactory.java:210)
    at org.gradle.launcher.cli.JavaRuntimeValidationAction.execute(JavaRuntimeValidationAction.java:35)
    at org.gradle.launcher.cli.JavaRuntimeValidationAction.execute(JavaRuntimeValidationAction.java:24)
    at org.gradle.launcher.cli.CommandLineActionFactory$WithLogging.execute(CommandLineActionFactory.java:206)
    at org.gradle.launcher.cli.CommandLineActionFactory$WithLogging.execute(CommandLineActionFactory.java:169)
    at org.gradle.launcher.cli.ExceptionReportingAction.execute(ExceptionReportingAction.java:33)
    at org.gradle.launcher.cli.ExceptionReportingAction.execute(ExceptionReportingAction.java:22)
    at org.gradle.launcher.Main.doAction(Main.java:33)
    at org.gradle.launcher.bootstrap.EntryPoint.run(EntryPoint.java:45)
    at sun.reflect.NativeMethodAccessorImpl.invoke0(Native Method)
    at sun.reflect.NativeMethodAccessorImpl.invoke(NativeMethodAccessorImpl.java:62)
    at sun.reflect.DelegatingMethodAccessorImpl.invoke(DelegatingMethodAccessorImpl.java:43)
    at java.lang.reflect.Method.invoke(Method.java:498)
    at org.gradle.launcher.bootstrap.ProcessBootstrap.runNoExit(ProcessBootstrap.java:54)
    at org.gradle.launcher.bootstrap.ProcessBootstrap.run(ProcessBootstrap.java:35)
    at org.gradle.launcher.GradleMain.main(GradleMain.java:23)
    at sun.reflect.NativeMethodAccessorImpl.invoke0(Native Method)
    at sun.reflect.NativeMethodAccessorImpl.invoke(NativeMethodAccessorImpl.java:62)
    at sun.reflect.DelegatingMethodAccessorImpl.invoke(DelegatingMethodAccessorImpl.java:43)
    at java.lang.reflect.Method.invoke(Method.java:498)
    at org.gradle.wrapper.BootstrapMainStarter.start(BootstrapMainStarter.java:33)
    at org.gradle.wrapper.WrapperExecutor.execute(WrapperExecutor.java:130)
    at org.gradle.wrapper.GradleWrapperMain.main(GradleWrapperMain.java:48)

:ios:buildApp FAILED

FAILURE: Build failed with an exception.

* What went wrong:
Execution failed for task ':ios:buildApp'.
> sdkVersion option is required!

watson_y_
Beginner
86 Views

 I run with this issue too, can u teach me how to fix this bug ?

Alex5
Beginner
86 Views

Yes, guys, sadly me too. I can only build and run iOS module from Xcode. It's very inconvenient.
gaston-hillar
Black Belt
86 Views

Unluckily, I face the same issue, the same situation that y2k explains. iOS modules build and run on XCode, but build from Android Studio on OS X fails with the same issues.

Alexey_S_Intel1
Employee
86 Views

Hi all,

Please report all issues with Multi-OS Engine in dedicated forum here: https://software.intel.com/en-us/forums/multi-os-engine, because MOE team doesn't monitor this forum.

This particular issue will be discussed here: https://software.intel.com/en-us/forums/multi-os-engine/topic/626510

Alexey

gaston-hillar
Black Belt
86 Views

Alexey,

Thanks for the info. I didn't realize there was a specific forum when I added my previous comment.

Reply