Community
cancel
Showing results for 
Search instead for 
Did you mean: 
Highlighted
25 Views

Error log compilation

Hello, I have this error at the end of the compilation:

--------------------------------

Calling plugman.fetch on plugin ".../cachedPlugins.ZuikY9.tmp/cache._N_noL.pl/cordova-plugin-device"
Copying plugin ".../cachedPlugins.ZuikY9.tmp/cache._N_noL.pl/cordova-plugin-device" => ".../cordova_project/plugins/cordova-plugin-device"
Calling plugman.install on plugin ".../cordova_project/plugins/cordova-plugin-device" for platform "android
Installing "cordova-plugin-device" for android
Running command: .../cordova_project/platforms/android/cordova/version 
Command finished with error code 0: .../cordova_project/platforms/android/cordova/version 
Install start for "cordova-plugin-device" on android.
Install complete for cordova-plugin-device on android.
Searching PlatformJson files for differences between project vs. platform installed plugins
No differences found between project and android platform. Continuing...
Generating config.xml from defaults for platform "android"
Wrote out Android application name to "testAppodeal"
Wrote out Android package name to "com.theMnkStudio.testAppodealMNK"
This app does not have launcher icons defined
updated project successfully
Calling plugman.fetch on plugin ".../cachedPlugins.ZuikY9.tmp/cache.poCq_U.pl/cordova-plugin-splashscreen"
Copying plugin ".../cachedPlugins.ZuikY9.tmp/cache.poCq_U.pl/cordova-plugin-splashscreen" => ".../cordova_project/plugins/cordova-plugin-splashscreen"
Calling plugman.install on plugin ".../cordova_project/plugins/cordova-plugin-splashscreen" for platform "android
Installing "cordova-plugin-splashscreen" for android
Running command: .../cordova_project/platforms/android/cordova/version 
Command finished with error code 0: .../cordova_project/platforms/android/cordova/version 
Install start for "cordova-plugin-splashscreen" on android.
Install complete for cordova-plugin-splashscreen on android.
Searching PlatformJson files for differences between project vs. platform installed plugins
No differences found between project and android platform. Continuing...
Generating config.xml from defaults for platform "android"
Wrote out Android application name to "testAppodeal"
Wrote out Android package name to "com.theMnkStudio.testAppodealMNK"
This app does not have launcher icons defined
updated project successfully
Calling plugman.fetch on plugin ".../cachedPlugins.ZuikY9.tmp/cache.iGMqDA.pl/cordova-plugin-statusbar"
Copying plugin ".../cachedPlugins.ZuikY9.tmp/cache.iGMqDA.pl/cordova-plugin-statusbar" => ".../cordova_project/plugins/cordova-plugin-statusbar"
Calling plugman.install on plugin ".../cordova_project/plugins/cordova-plugin-statusbar" for platform "android
Installing "cordova-plugin-statusbar" for android
Running command: .../cordova_project/platforms/android/cordova/version 
Command finished with error code 0: .../cordova_project/platforms/android/cordova/version 
Install start for "cordova-plugin-statusbar" on android.
Install complete for cordova-plugin-statusbar on android.
Searching PlatformJson files for differences between project vs. platform installed plugins
No differences found between project and android platform. Continuing...
Generating config.xml from defaults for platform "android"
Wrote out Android application name to "testAppodeal"
Wrote out Android package name to "com.theMnkStudio.testAppodealMNK"
This app does not have launcher icons defined
updated project successfully
Calling plugman.fetch on plugin ".../cachedPlugins.ZuikY9.tmp/cache.uwSh5S.pl/com.appodeal.plugin"
Copying plugin ".../cachedPlugins.ZuikY9.tmp/cache.uwSh5S.pl/com.appodeal.plugin" => ".../cordova_project/plugins/com.appodeal.plugin"
Calling plugman.install on plugin ".../cordova_project/plugins/com.appodeal.plugin" for platform "android
Installing "com.appodeal.plugin" for android
Running command: .../cordova_project/platforms/android/cordova/version 
Command finished with error code 0: .../cordova_project/platforms/android/cordova/version 
Install start for "com.appodeal.plugin" on android.
Install complete for com.appodeal.plugin on android.
Searching PlatformJson files for differences between project vs. platform installed plugins
No differences found between project and android platform. Continuing...
Generating config.xml from defaults for platform "android"
Wrote out Android application name to "testAppodeal"
Wrote out Android package name to "com.theMnkStudio.testAppodealMNK"
This app does not have launcher icons defined
updated project successfully
Calling plugman.fetch on plugin ".../cachedPlugins.ZuikY9.tmp/cache.rxKb9J.pl/cordova-plugin-whitelist"
Copying plugin ".../cachedPlugins.ZuikY9.tmp/cache.rxKb9J.pl/cordova-plugin-whitelist" => ".../cordova_project/plugins/cordova-plugin-whitelist"
Calling plugman.install on plugin ".../cordova_project/plugins/cordova-plugin-whitelist" for platform "android
Installing "cordova-plugin-whitelist" for android
Running command: .../cordova_project/platforms/android/cordova/version 
Command finished with error code 0: .../cordova_project/platforms/android/cordova/version 
Install start for "cordova-plugin-whitelist" on android.
Install complete for cordova-plugin-whitelist on android.

               This plugin is only applicable for versions of cordova-android greater than 4.0. If you have a previous platform version, you do *not* need this plugin since the whitelist will be built in.
          
Searching PlatformJson files for differences between project vs. platform installed plugins
No differences found between project and android platform. Continuing...
Generating config.xml from defaults for platform "android"
Wrote out Android application name to "testAppodeal"
Wrote out Android package name to "com.theMnkStudio.testAppodealMNK"
This app does not have launcher icons defined
updated project successfully
Calling plugman.fetch on plugin ".../cachedPlugins.ZuikY9.tmp/cache.QwQkuO.pl/cordova-plugin-crosswalk-webview"
Copying plugin ".../cachedPlugins.ZuikY9.tmp/cache.QwQkuO.pl/cordova-plugin-crosswalk-webview" => ".../cordova_project/plugins/cordova-plugin-crosswalk-webview"
Calling plugman.install on plugin ".../cordova_project/plugins/cordova-plugin-crosswalk-webview" for platform "android
Installing "cordova-plugin-crosswalk-webview" for android
Running command: .../cordova_project/platforms/android/cordova/version 
Command finished with error code 0: .../cordova_project/platforms/android/cordova/version 
Install start for "cordova-plugin-crosswalk-webview" on android.
Install complete for cordova-plugin-crosswalk-webview on android.
Searching PlatformJson files for differences between project vs. platform installed plugins
No differences found between project and android platform. Continuing...
Generating config.xml from defaults for platform "android"
Wrote out Android application name to "testAppodeal"
Wrote out Android package name to "com.theMnkStudio.testAppodealMNK"
This app does not have launcher icons defined
updated project successfully
Searching PlatformJson files for differences between project vs. platform installed plugins
No differences found between project and android platform. Continuing...
Generating config.xml from defaults for platform "android"
Wrote out Android application name to "testAppodeal"
Wrote out Android package name to "com.theMnkStudio.testAppodealMNK"
This app does not have launcher icons defined
updated project successfully
************* Processing the main config.xml file (after_prepare)  *****************
App Directory = [.../cordova_project]
Will process and update the following config files:
    Config.xml = [.../cordova_project/config.xml]
Namespaces:
    prefix/uri ''/'http://www.w3.org/ns/widgets'
    prefix/uri 'intelxdk'/'http://xdk.intel.com/ns/v1'
Android Manifest Namespaces:
    prefix/uri 'android'/'http://schemas.android.com/apk/res/android'
Name of the app is [testAppodeal]
Updating full app name to [testAppodeal]
Processing preference android-minSdkVersion [17]
Processing preference android-targetSdkVersion [21]
Processing preference android-installLocation [auto]
Processing preference permissions
Updating the versionCode
Updating the versionName
Processing debuggable
Added [{http://schemas.android.com/apk/res/android}debuggable] with [false]
Processing config file values
Saving config.xml to [.../cordova_project/config.xml]
************* Completed processing the main config.xml file (after_prepare)  *****************
ANDROID_HOME=.../android-sdk/
JAVA_HOME=/usr/lib/jvm/java-8-oracle-amd64
Downloading file://.../cordova/gradle/gradle-2.2.1-all.zip
..................................................................................................................................................................................................................................................................................................................................................................................................................................................................................................................................................................................................................................................................................................................................................................................................................................................................................................................................................................................................................................................................................................................................................................................................................................................................................................................................................................................................................................................................................................................................................................................................................................................................................................................................................................................................................................................................................................................................................................................................................................................................................................................................................................................................................................................................................................................................................................................................................................................................................................................................................................................................................................................................................................................................................................................................................................................................................................................................................................................................................................................
Unzipping /home/builduser/.gradle/wrapper/dists/gradle-2.2.1-all/3d6ng971birsf8vhjv1s2o93eu/gradle-2.2.1-all.zip to /home/builduser/.gradle/wrapper/dists/gradle-2.2.1-all/3d6ng971birsf8vhjv1s2o93eu
Set executable permissions for: /home/builduser/.gradle/wrapper/dists/gradle-2.2.1-all/3d6ng971birsf8vhjv1s2o93eu/gradle-2.2.1/bin/gradle
Download https://repo1.maven.org/maven2/com/android/tools/build/gradle/1.0.0/gradle-1.0.0.pom
Download https://repo1.maven.org/maven2/com/android/tools/build/builder/1.0.0/builder-1.0.0.pom
Download https://repo1.maven.org/maven2/com/android/tools/lint/lint/24.0.0/lint-24.0.0.pom
Download https://repo1.maven.org/maven2/net/sf/proguard/proguard-gradle/5.1/proguard-gradle-5.1.pom
Download https://repo1.maven.org/maven2/net/sf/proguard/proguard-parent/5.1/proguard-parent-5.1.pom
Download https://repo1.maven.org/maven2/com/android/tools/sdk-common/24.0.0/sdk-common-24.0.0.pom
Download https://repo1.maven.org/maven2/org/bouncycastle/bcprov-jdk15on/1.48/bcprov-jdk15on-1.48.pom
Download https://repo1.maven.org/maven2/com/squareup/javawriter/2.5.0/javawriter-2.5.0.pom
Download https://repo1.maven.org/maven2/org/sonatype/oss/oss-parent/7/oss-parent-7.pom
Download https://repo1.maven.org/maven2/com/android/tools/common/24.0.0/common-24.0.0.pom
Download https://repo1.maven.org/maven2/com/android/tools/build/builder-test-api/1.0.0/builder-test-api-1.0.0...
Download https://repo1.maven.org/maven2/com/android/tools/ddms/ddmlib/24.0.0/ddmlib-24.0.0.pom
Download https://repo1.maven.org/maven2/com/android/tools/build/manifest-merger/24.0.0/manifest-merger-24.0.0...
Download https://repo1.maven.org/maven2/com/android/tools/build/builder-model/1.0.0/builder-model-1.0.0.pom
Download https://repo1.maven.org/maven2/com/android/tools/sdklib/24.0.0/sdklib-24.0.0.pom
Download https://repo1.maven.org/maven2/org/bouncycastle/bcpkix-jdk15on/1.48/bcpkix-jdk15on-1.48.pom
Download https://repo1.maven.org/maven2/com/android/tools/lint/lint-checks/24.0.0/lint-checks-24.0.0.pom
Download https://repo1.maven.org/maven2/org/eclipse/jdt/core/compiler/ecj/4.2.2/ecj-4.2.2.pom
Download https://repo1.maven.org/maven2/net/sf/proguard/proguard-base/5.1/proguard-base-5.1.pom
Download https://repo1.maven.org/maven2/com/google/guava/guava/17.0/guava-17.0.pom
Download https://repo1.maven.org/maven2/com/google/guava/guava-parent/17.0/guava-parent-17.0.pom
Download https://repo1.maven.org/maven2/net/sf/kxml/kxml2/2.3.0/kxml2-2.3.0.pom
Download https://repo1.maven.org/maven2/com/android/tools/layoutlib/layoutlib-api/24.0.0/layoutlib-api-24.0.0...
Download https://repo1.maven.org/maven2/org/apache/httpcomponents/httpclient/4.1.1/httpclient-4.1.1.pom
Download https://repo1.maven.org/maven2/org/apache/httpcomponents/httpcomponents-client/4.1.1/httpcomponents-...
Download https://repo1.maven.org/maven2/org/apache/httpcomponents/project/4.1.1/project-4.1.1.pom
Download https://repo1.maven.org/maven2/org/apache/httpcomponents/httpmime/4.1/httpmime-4.1.pom
Download https://repo1.maven.org/maven2/org/apache/httpcomponents/httpcomponents-client/4.1/httpcomponents-cl...
Download https://repo1.maven.org/maven2/com/android/tools/dvlib/24.0.0/dvlib-24.0.0.pom
Download https://repo1.maven.org/maven2/org/apache/commons/commons-compress/1.8.1/commons-compress-1.8.1.pom
Download https://repo1.maven.org/maven2/org/apache/commons/commons-parent/33/commons-parent-33.pom
Download https://repo1.maven.org/maven2/org/apache/apache/13/apache-13.pom
Download https://repo1.maven.org/maven2/com/android/tools/lint/lint-api/24.0.0/lint-api-24.0.0.pom
Download https://repo1.maven.org/maven2/org/ow2/asm/asm-analysis/4.0/asm-analysis-4.0.pom
Download https://repo1.maven.org/maven2/org/ow2/asm/asm-parent/4.0/asm-parent-4.0.pom
Download https://repo1.maven.org/maven2/org/ow2/ow2/1.3/ow2-1.3.pom
Download https://repo1.maven.org/maven2/org/apache/httpcomponents/httpcore/4.1/httpcore-4.1.pom
Download https://repo1.maven.org/maven2/org/apache/httpcomponents/httpcomponents-core/4.1/httpcomponents-core...
Download https://repo1.maven.org/maven2/commons-logging/commons-logging/1.1.1/commons-logging-1.1.1.pom
Download https://repo1.maven.org/maven2/org/apache/commons/commons-parent/5/commons-parent-5.pom
Download https://repo1.maven.org/maven2/org/apache/apache/4/apache-4.pom
Download https://repo1.maven.org/maven2/commons-codec/commons-codec/1.4/commons-codec-1.4.pom
Download https://repo1.maven.org/maven2/org/apache/commons/commons-parent/11/commons-parent-11.pom
Download https://repo1.maven.org/maven2/org/ow2/asm/asm/4.0/asm-4.0.pom
Download https://repo1.maven.org/maven2/com/android/tools/external/lombok/lombok-ast/0.2.2/lombok-ast-0.2.2.p...
Download https://repo1.maven.org/maven2/org/ow2/asm/asm-tree/4.0/asm-tree-4.0.pom
Download https://repo1.maven.org/maven2/com/android/tools/build/gradle/1.0.0/gradle-1.0.0.jar
Download https://repo1.maven.org/maven2/com/android/tools/build/builder/1.0.0/builder-1.0.0.jar
Download https://repo1.maven.org/maven2/com/android/tools/lint/lint/24.0.0/lint-24.0.0.jar
Download https://repo1.maven.org/maven2/net/sf/proguard/proguard-gradle/5.1/proguard-gradle-5.1.jar
Download https://repo1.maven.org/maven2/com/android/tools/sdk-common/24.0.0/sdk-common-24.0.0.jar
Download https://repo1.maven.org/maven2/org/bouncycastle/bcprov-jdk15on/1.48/bcprov-jdk15on-1.48.jar
Download https://repo1.maven.org/maven2/com/squareup/javawriter/2.5.0/javawriter-2.5.0.jar
Download https://repo1.maven.org/maven2/com/android/tools/common/24.0.0/common-24.0.0.jar
Download https://repo1.maven.org/maven2/com/android/tools/build/builder-test-api/1.0.0/builder-test-api-1.0.0...
Download https://repo1.maven.org/maven2/com/android/tools/ddms/ddmlib/24.0.0/ddmlib-24.0.0.jar
Download https://repo1.maven.org/maven2/com/android/tools/build/manifest-merger/24.0.0/manifest-merger-24.0.0...
Download https://repo1.maven.org/maven2/com/android/tools/build/builder-model/1.0.0/builder-model-1.0.0.jar
Download https://repo1.maven.org/maven2/com/android/tools/sdklib/24.0.0/sdklib-24.0.0.jar
Download https://repo1.maven.org/maven2/org/bouncycastle/bcpkix-jdk15on/1.48/bcpkix-jdk15on-1.48.jar
Download https://repo1.maven.org/maven2/com/android/tools/lint/lint-checks/24.0.0/lint-checks-24.0.0.jar
Download https://repo1.maven.org/maven2/org/eclipse/jdt/core/compiler/ecj/4.2.2/ecj-4.2.2.jar
Download https://repo1.maven.org/maven2/net/sf/proguard/proguard-base/5.1/proguard-base-5.1.jar
Download https://repo1.maven.org/maven2/com/google/guava/guava/17.0/guava-17.0.jar
Download https://repo1.maven.org/maven2/net/sf/kxml/kxml2/2.3.0/kxml2-2.3.0.jar
Download https://repo1.maven.org/maven2/com/android/tools/layoutlib/layoutlib-api/24.0.0/layoutlib-api-24.0.0...
Download https://repo1.maven.org/maven2/org/apache/httpcomponents/httpclient/4.1.1/httpclient-4.1.1.jar
Download https://repo1.maven.org/maven2/org/apache/httpcomponents/httpmime/4.1/httpmime-4.1.jar
Download https://repo1.maven.org/maven2/com/android/tools/dvlib/24.0.0/dvlib-24.0.0.jar
Download https://repo1.maven.org/maven2/org/apache/commons/commons-compress/1.8.1/commons-compress-1.8.1.jar
Download https://repo1.maven.org/maven2/com/android/tools/lint/lint-api/24.0.0/lint-api-24.0.0.jar
Download https://repo1.maven.org/maven2/org/ow2/asm/asm-analysis/4.0/asm-analysis-4.0.jar
Download https://repo1.maven.org/maven2/org/apache/httpcomponents/httpcore/4.1/httpcore-4.1.jar
Download https://repo1.maven.org/maven2/commons-logging/commons-logging/1.1.1/commons-logging-1.1.1.jar
Download https://repo1.maven.org/maven2/commons-codec/commons-codec/1.4/commons-codec-1.4.jar
Download https://repo1.maven.org/maven2/org/ow2/asm/asm/4.0/asm-4.0.jar
Download https://repo1.maven.org/maven2/com/android/tools/external/lombok/lombok-ast/0.2.2/lombok-ast-0.2.2.j...
Download https://repo1.maven.org/maven2/org/ow2/asm/asm-tree/4.0/asm-tree-4.0.jar
null
WARNING [Project: :] Current NDK support is deprecated.  Alternative will be provided in the future.
WARNING [Project: :] Current NDK support is deprecated.  Alternative will be provided in the future.
WARNING [Project: :] Current NDK support is deprecated.  Alternative will be provided in the future.
WARNING [Project: :] Current NDK support is deprecated.  Alternative will be provided in the future.
org.xwalk:xwalk_core_library:19+
Download https://download.01.org/crosswalk/releases/crosswalk/android/maven2/org/xwalk/xwalk_core_library/19....
Download https://download.01.org/crosswalk/releases/crosswalk/android/maven2/org/xwalk/xwalk_core_library/19....
:preBuild
:compileArmv7ReleaseNdk
:preArmv7ReleaseBuild
:checkArmv7ReleaseManifest
:preX86ReleaseBuild
:CordovaLib:compileLint
:CordovaLib:copyReleaseLint UP-TO-DATE
:CordovaLib:mergeReleaseProguardFiles
:CordovaLib:preBuild
:CordovaLib:preReleaseBuild
:CordovaLib:checkReleaseManifest
:CordovaLib:prepareReleaseDependencies
:CordovaLib:compileReleaseAidl
:CordovaLib:compileReleaseRenderscript
:CordovaLib:generateReleaseBuildConfig
:CordovaLib:generateReleaseAssets UP-TO-DATE
:CordovaLib:mergeReleaseAssets
:CordovaLib:generateReleaseResValues
:CordovaLib:generateReleaseResources
:CordovaLib:packageReleaseResources
:CordovaLib:processReleaseManifest
:CordovaLib:processReleaseResources
:CordovaLib:generateReleaseSources
:CordovaLib:compileReleaseJavaNote: Some input files use or override a deprecated API.
Note: Recompile with -Xlint:deprecation for details.

:CordovaLib:processReleaseJavaRes UP-TO-DATE
:CordovaLib:packageReleaseJar
:CordovaLib:compileReleaseNdk
:CordovaLib:packageReleaseJniLibs UP-TO-DATE
:CordovaLib:packageReleaseLocalJar UP-TO-DATE
:CordovaLib:packageReleaseRenderscript UP-TO-DATE
:CordovaLib:bundleRelease
:com.appodeal.plugin:cheetah-mobile:compileLint
:com.appodeal.plugin:cheetah-mobile:copyReleaseLint UP-TO-DATE
:com.appodeal.plugin:cheetah-mobile:mergeReleaseProguardFiles
:com.appodeal.plugin:cheetah-mobile:preBuild
:com.appodeal.plugin:cheetah-mobile:preReleaseBuild
:com.appodeal.plugin:cheetah-mobile:checkReleaseManifest
:com.appodeal.plugin:cheetah-mobile:prepareAndroidCordovaLibUnspecifiedReleaseLibrary
:com.appodeal.plugin:cheetah-mobile:prepareReleaseDependencies
:com.appodeal.plugin:cheetah-mobile:compileReleaseAidl
:com.appodeal.plugin:cheetah-mobile:compileReleaseRenderscript
:com.appodeal.plugin:cheetah-mobile:generateReleaseBuildConfig
:com.appodeal.plugin:cheetah-mobile:generateReleaseAssets UP-TO-DATE
:com.appodeal.plugin:cheetah-mobile:mergeReleaseAssets
:com.appodeal.plugin:cheetah-mobile:generateReleaseResValues
:com.appodeal.plugin:cheetah-mobile:generateReleaseResources
:com.appodeal.plugin:cheetah-mobile:mergeReleaseResources
:com.appodeal.plugin:cheetah-mobile:processReleaseManifest
:com.appodeal.plugin:cheetah-mobile:processReleaseResources
:com.appodeal.plugin:cheetah-mobile:generateReleaseSources
:com.appodeal.plugin:cheetah-mobile:compileReleaseJava
:com.appodeal.plugin:cheetah-mobile:processReleaseJavaRes UP-TO-DATE
:com.appodeal.plugin:cheetah-mobile:packageReleaseJar
:com.appodeal.plugin:cheetah-mobile:compileReleaseNdk
:com.appodeal.plugin:cheetah-mobile:packageReleaseJniLibs UP-TO-DATE
:com.appodeal.plugin:cheetah-mobile:packageReleaseLocalJar
:com.appodeal.plugin:cheetah-mobile:packageReleaseRenderscript UP-TO-DATE
:com.appodeal.plugin:cheetah-mobile:packageReleaseResources
:com.appodeal.plugin:cheetah-mobile:bundleRelease
:prepareAndroidComAppodealPluginCheetahMobileUnspecifiedReleaseLibrary
:prepareAndroidCordovaLibUnspecifiedReleaseLibrary
:preArmv7DebugBuild
:preX86DebugBuild
:CordovaLib:copyDebugLint UP-TO-DATE
:CordovaLib:mergeDebugProguardFiles
:CordovaLib:preDebugBuild
:CordovaLib:checkDebugManifest
:CordovaLib:prepareDebugDependencies
:CordovaLib:compileDebugAidl
:CordovaLib:compileDebugRenderscript
:CordovaLib:generateDebugBuildConfig
:CordovaLib:generateDebugAssets UP-TO-DATE
:CordovaLib:mergeDebugAssets
:CordovaLib:generateDebugResValues
:CordovaLib:generateDebugResources
:CordovaLib:packageDebugResources
:CordovaLib:processDebugManifest
:CordovaLib:processDebugResources
:CordovaLib:generateDebugSources
:CordovaLib:compileDebugJavaNote: Some input files use or override a deprecated API.
Note: Recompile with -Xlint:deprecation for details.

:CordovaLib:processDebugJavaRes UP-TO-DATE
:CordovaLib:packageDebugJar
:CordovaLib:compileDebugNdk
:CordovaLib:packageDebugJniLibs UP-TO-DATE
:CordovaLib:packageDebugLocalJar UP-TO-DATE
:CordovaLib:packageDebugRenderscript UP-TO-DATE
:CordovaLib:bundleDebug
:com.appodeal.plugin:cheetah-mobile:copyDebugLint UP-TO-DATE
:com.appodeal.plugin:cheetah-mobile:mergeDebugProguardFiles
:com.appodeal.plugin:cheetah-mobile:preDebugBuild
:com.appodeal.plugin:cheetah-mobile:checkDebugManifest
:com.appodeal.plugin:cheetah-mobile:preDebugTestBuild
:com.appodeal.plugin:cheetah-mobile:prepareAndroidCordovaLibUnspecifiedDebugLibrary
:com.appodeal.plugin:cheetah-mobile:prepareDebugDependencies
:com.appodeal.plugin:cheetah-mobile:compileDebugAidl
:com.appodeal.plugin:cheetah-mobile:compileDebugRenderscript
:com.appodeal.plugin:cheetah-mobile:generateDebugBuildConfig
:com.appodeal.plugin:cheetah-mobile:generateDebugAssets UP-TO-DATE
:com.appodeal.plugin:cheetah-mobile:mergeDebugAssets
:com.appodeal.plugin:cheetah-mobile:generateDebugResValues
:com.appodeal.plugin:cheetah-mobile:generateDebugResources
:com.appodeal.plugin:cheetah-mobile:mergeDebugResources
:com.appodeal.plugin:cheetah-mobile:processDebugManifest
:com.appodeal.plugin:cheetah-mobile:processDebugResources
:com.appodeal.plugin:cheetah-mobile:generateDebugSources
:com.appodeal.plugin:cheetah-mobile:compileDebugJava
:com.appodeal.plugin:cheetah-mobile:processDebugJavaRes UP-TO-DATE
:com.appodeal.plugin:cheetah-mobile:packageDebugJar
:com.appodeal.plugin:cheetah-mobile:compileDebugNdk
:com.appodeal.plugin:cheetah-mobile:packageDebugJniLibs UP-TO-DATE
:com.appodeal.plugin:cheetah-mobile:packageDebugLocalJar
:com.appodeal.plugin:cheetah-mobile:packageDebugRenderscript UP-TO-DATE
:com.appodeal.plugin:cheetah-mobile:packageDebugResources
:com.appodeal.plugin:cheetah-mobile:bundleDebug
:prepareComAndroidSupportSupportCompat2500Library
:prepareComAndroidSupportSupportCoreUi2500Library
:prepareComAndroidSupportSupportCoreUtils2500Library
:prepareComAndroidSupportSupportFragment2500Library
:prepareComAndroidSupportSupportMediaCompat2500Library
:prepareComAndroidSupportSupportV42500Library
:prepareComGoogleAndroidGmsPlayServicesAds980Library
:prepareComGoogleAndroidGmsPlayServicesAdsLite980Library
:prepareComGoogleAndroidGmsPlayServicesBase980Library
:prepareComGoogleAndroidGmsPlayServicesBasement980Library
:prepareComGoogleAndroidGmsPlayServicesClearcut980Library
:prepareComGoogleAndroidGmsPlayServicesGass980Library
:prepareComGoogleAndroidGmsPlayServicesTasks980Library
:prepareOrgXwalkXwalk_core_library19495145Library
:prepareArmv7ReleaseDependencies
:compileArmv7ReleaseAidl
:compileArmv7ReleaseRenderscript
:generateArmv7ReleaseBuildConfig
:generateArmv7ReleaseAssets UP-TO-DATE
:mergeArmv7ReleaseAssets
:createXwalkCommandLineFileArmv7Release
:generateArmv7ReleaseResValues
:generateArmv7ReleaseResources
:mergeArmv7ReleaseResources
:processArmv7ReleaseManifest
:processArmv7ReleaseResources
:generateArmv7ReleaseSources
:compileArmv7ReleaseJavaNote: Some input files use or override a deprecated API.
Note: Recompile with -Xlint:deprecation for details.

:preDexArmv7Release
:dexArmv7Release
UNEXPECTED TOP-LEVEL EXCEPTION:
com.android.dex.DexIndexOverflowException: method ID not in [0, 0xffff]: 65536
	at com.android.dx.merge.DexMerger$6.updateIndex(DexMerger.java:502)
	at com.android.dx.merge.DexMerger$IdMerger.mergeSorted(DexMerger.java:277)
	at com.android.dx.merge.DexMerger.mergeMethodIds(DexMerger.java:491)
	at com.android.dx.merge.DexMerger.mergeDexes(DexMerger.java:168)
	at com.android.dx.merge.DexMerger.merge(DexMerger.java:189)
	at com.android.dx.command.dexer.Main.mergeLibraryDexBuffers(Main.java:454)
	at com.android.dx.command.dexer.Main.runMonoDex(Main.java:303)
	at com.android.dx.command.dexer.Main.run(Main.java:246)
	at com.android.dx.command.dexer.Main.main(Main.java:215)
	at com.android.dx.command.Main.main(Main.java:106)

 FAILED

FAILURE: Build failed with an exception.

* What went wrong:
Execution failed for task ':dexArmv7Release'.
> com.android.ide.common.internal.LoggedErrorException: Failed to run command:
  	.../android-sdk/build-tools/21.1.2/dx --dex --output .../cordova_project/platforms/android/build/intermediates/dex/armv7/release --input-list=.../cordova_project/platforms/android/build/intermediates/tmp/dex/armv7/release/inputList.txt
  Error Code:
  	2
  Output:
  	
  	UNEXPECTED TOP-LEVEL EXCEPTION:
  	com.android.dex.DexIndexOverflowException: method ID not in [0, 0xffff]: 65536
  		at com.android.dx.merge.DexMerger$6.updateIndex(DexMerger.java:502)
  		at com.android.dx.merge.DexMerger$IdMerger.mergeSorted(DexMerger.java:277)
  		at com.android.dx.merge.DexMerger.mergeMethodIds(DexMerger.java:491)
  		at com.android.dx.merge.DexMerger.mergeDexes(DexMerger.java:168)
  		at com.android.dx.merge.DexMerger.merge(DexMerger.java:189)
  		at com.android.dx.command.dexer.Main.mergeLibraryDexBuffers(Main.java:454)
  		at com.android.dx.command.dexer.Main.runMonoDex(Main.java:303)
  		at com.android.dx.command.dexer.Main.run(Main.java:246)
  		at com.android.dx.command.dexer.Main.main(Main.java:215)
  		at com.android.dx.command.Main.main(Main.java:106)
  	


* Try:
Run with --stacktrace option to get the stack trace. Run with --info or --debug option to get more log output.

BUILD FAILED

Total time: 2 mins 45.885 secs
ERROR building one of the platforms: Error: .../cordova_project/platforms/android/gradlew: Command failed with exit code 1
You may not have the required environment or OS to build this project
Error: .../cordova_project/platforms/android/gradlew: Command failed with exit code 1
    at ChildProcess.whenDone (.../cordova_project/platforms/android/cordova/node_modules/cordova-common/src/superspawn.js:139:23)
    at emitTwo (events.js:87:13)
    at ChildProcess.emit (events.js:172:7)
    at maybeClose (internal/child_process.js:821:16)
    at Process.ChildProcess._handle.onexit (internal/child_process.js:211:5)

--------------------------------------------

What is it? What can I do to fix it?
This is an android app.
Sorry for my english, if you need more information do not hesitate to ask me, I am looking forward to correct this error.

Tags (2)
0 Kudos
3 Replies
Highlighted
Employee
25 Views

 

The error seems to be explained in: http://stackoverflow.com/questions/26515378/dexindexoverflowexception-issue-after-updating-to-latest...

Let us investigate more on what could be done and I'll get back to you.

 

 

0 Kudos
Highlighted
25 Views

Juan Pablo -- after reviewing the SO post that Shahab identified, it appears that this is a problem that is not easily resolved with out build system. Because our build system is in the cloud, you do not have access to the files that need to be modified in order to implement the solution to the problem, especially the build.gradle file.

One solution is to simplify the complexity of your app (decrease the number of methods in your app), as suggested by the winning SO response. If that is not possible, you may have to implement the multidex solution, which requires that you build the app locally using Cordova CLI. Some basic instructions on how to convert your XDK project into a Cordova CLI project can be found here > https://software.intel.com/en-us/forums/intel-xdk/topic/685326#comment-1885369 <

0 Kudos
Highlighted
25 Views

Paul F. (Intel) wrote:

Juan Pablo -- after reviewing the SO post that Shahab identified, it appears that this is a problem that is not easily resolved with out build system. Because our build system is in the cloud, you do not have access to the files that need to be modified in order to implement the solution to the problem, especially the build.gradle file.

One solution is to simplify the complexity of your app (decrease the number of methods in your app), as suggested by the winning SO response. If that is not possible, you may have to implement the multidex solution, which requires that you build the app locally using Cordova CLI. Some basic instructions on how to convert your XDK project into a Cordova CLI project can be found here > https://software.intel.com/en-us/forums/intel-xdk/topic/685326#comment-1... <

It is useful to know this, although if I use another plugin this error no longer occurs, I was using a plugin to show advertising but I changed it for another version and I no longer have this error.

Thanks for the information and for your time.

0 Kudos