Community
cancel
Showing results for 
Search instead for 
Did you mean: 
Highlighted
Community Manager
331 Views

install ncsdk1.x on ubuntu1604 which is a docker image

Hi,

 

I need install ncsdk1.12 on ubuntu1604 which is a docker image.But I encountering this error when building.

 

collect2: error: ld returned 1 exit status

 

tools/CMakeFiles/upgrade_solver_proto_text.dir/build.make:129: recipe for target 'tools/upgrade_solver_proto_text' failed

 

make[2]: *** [tools/upgrade_solver_proto_text] Error 1

 

CMakeFiles/Makefile2:479: recipe for target 'tools/CMakeFiles/upgrade_solver_proto_text.dir/all' failed

 

make[1]: *** [tools/CMakeFiles/upgrade_solver_proto_text.dir/all] Error 2

 

Your help will be greatly appreciated!

 

Thanks

0 Kudos
1 Reply
Highlighted
Community Manager
20 Views

Hi @youju

 

We have not tested the NCSDK 1.12 installation on a docker image. However, we have an installation and configuration with docker guide for the NCSDK 2.x.

 

Take a look at this link: https://movidius.github.io/ncsdk/docker.html

 

Hope this helps!

 

Regards,

 

Jesus
0 Kudos